Date   
Build failed in Jenkins: device-grove-c-snap-master-stage-snap #240 #jenkins

Jenkins <jenkins-donotreply@...>
 

See <https://jenkins.edgexfoundry.org/job/device-grove-c-snap-master-stage-snap/240/display/redirect>

Changes:


------------------------------------------
[...truncated 141.89 KB...]
[device-grove-c-snap] $ /bin/bash /tmp/jenkins9045713960557427002.sh
---> sysstat.sh
[device-grove-c-snap] $ /bin/bash /tmp/jenkins6649138819887626769.sh
---> package-listing.sh
++ facter osfamily
++ tr '[:upper:]' '[:lower:]'
+ OS_FAMILY=redhat
+ workspace=<https://jenkins.edgexfoundry.org/job/device-grove-c-snap-master-stage-snap/ws/>
+ START_PACKAGES=/tmp/packages_start.txt
+ END_PACKAGES=/tmp/packages_end.txt
+ DIFF_PACKAGES=/tmp/packages_diff.txt
+ PACKAGES=/tmp/packages_start.txt
+ '[' <https://jenkins.edgexfoundry.org/job/device-grove-c-snap-master-stage-snap/ws/> ']'
+ PACKAGES=/tmp/packages_end.txt
+ case "${OS_FAMILY}" in
+ rpm -qa
+ sort
+ '[' -f /tmp/packages_start.txt ']'
+ '[' -f /tmp/packages_end.txt ']'
+ diff /tmp/packages_start.txt /tmp/packages_end.txt
+ '[' <https://jenkins.edgexfoundry.org/job/device-grove-c-snap-master-stage-snap/ws/> ']'
+ mkdir -p <https://jenkins.edgexfoundry.org/job/device-grove-c-snap-master-stage-snap/ws/archives/>
+ cp -f /tmp/packages_diff.txt /tmp/packages_end.txt /tmp/packages_start.txt <https://jenkins.edgexfoundry.org/job/device-grove-c-snap-master-stage-snap/ws/archives/>
provisioning config files...
copy managed file [jenkins-log-archives-settings] to file:<https://jenkins.edgexfoundry.org/job/device-grove-c-snap-master-stage-snap/ws/@tmp/config1623297215474661548tmp>
[device-grove-c-snap] $ /bin/bash /tmp/jenkins3793241762244861550.sh
---> edgex-infra-ship-logs.sh
Unable to find image 'nexus3.edgexfoundry.org:10003/edgex-lftools-log-publisher:x86_64' locally
x86_64: Pulling from edgex-lftools-log-publisher
e6b0cf9c0882: Pulling fs layer
da0e9bf0cc60: Pulling fs layer
c9ea274ed700: Pulling fs layer
9cfac6ba3733: Pulling fs layer
f6a933c9cadc: Pulling fs layer
61811dbd4963: Pulling fs layer
a6eb2c9e2280: Pulling fs layer
095dd8b7b4d8: Pulling fs layer
dc21a1d4508b: Pulling fs layer
363af2e989c4: Pulling fs layer
61811dbd4963: Waiting
a6eb2c9e2280: Waiting
095dd8b7b4d8: Waiting
dc21a1d4508b: Waiting
363af2e989c4: Waiting
9cfac6ba3733: Waiting
f6a933c9cadc: Waiting
da0e9bf0cc60: Verifying Checksum
da0e9bf0cc60: Download complete
e6b0cf9c0882: Verifying Checksum
e6b0cf9c0882: Download complete
f6a933c9cadc: Verifying Checksum
f6a933c9cadc: Download complete
a6eb2c9e2280: Verifying Checksum
a6eb2c9e2280: Download complete
c9ea274ed700: Verifying Checksum
c9ea274ed700: Download complete
095dd8b7b4d8: Verifying Checksum
095dd8b7b4d8: Download complete
363af2e989c4: Verifying Checksum
363af2e989c4: Download complete
e6b0cf9c0882: Pull complete
dc21a1d4508b: Verifying Checksum
dc21a1d4508b: Download complete
da0e9bf0cc60: Pull complete
61811dbd4963: Verifying Checksum
61811dbd4963: Download complete
c9ea274ed700: Pull complete
9cfac6ba3733: Pull complete
f6a933c9cadc: Pull complete
61811dbd4963: Pull complete
a6eb2c9e2280: Pull complete
095dd8b7b4d8: Pull complete
dc21a1d4508b: Pull complete
363af2e989c4: Pull complete
Digest: sha256:add8188b58b49eaf945790de1a8bc2588125c85e750a42d0a8acc29426f6ed5f
Status: Downloaded newer image for nexus3.edgexfoundry.org:10003/edgex-lftools-log-publisher:x86_64
---> create-netrc.sh
+ ARCHIVE_ARTIFACTS=
+ LOGS_SERVER=https://logs.edgexfoundry.org
+ '[' https://logs.edgexfoundry.org '==' None ]
+ NEXUS_URL=https://nexus.edgexfoundry.org
+ NEXUS_PATH=production/vex-yul-edgex-jenkins-1/device-grove-c-snap-master-stage-snap/240
+ BUILD_URL=https://jenkins.edgexfoundry.org/job/device-grove-c-snap-master-stage-snap/240/
---> logs-deploy.sh
+ lftools deploy archives -p https://nexus.edgexfoundry.org production/vex-yul-edgex-jenkins-1/device-grove-c-snap-master-stage-snap/240 <https://jenkins.edgexfoundry.org/job/device-grove-c-snap-master-stage-snap/ws/>
Archives upload complete.
+ lftools deploy logs https://nexus.edgexfoundry.org production/vex-yul-edgex-jenkins-1/device-grove-c-snap-master-stage-snap/240 https://jenkins.edgexfoundry.org/job/device-grove-c-snap-master-stage-snap/240/
---> uname -a:
Linux 5c22a0d726de 3.10.0-862.14.4.el7.x86_64 #1 SMP Wed Sep 26 15:12:11 UTC 2018 x86_64 Linux


---> lscpu:
Architecture: x86_64
CPU op-mode(s): 32-bit, 64-bit
Byte Order: Little Endian
Address sizes: 40 bits physical, 48 bits virtual
CPU(s): 4
On-line CPU(s) list: 0-3
Thread(s) per core: 1
Core(s) per socket: 1
Socket(s): 4
NUMA node(s): 1
Vendor ID: GenuineIntel
CPU family: 6
Model: 44
Model name: Westmere E56xx/L56xx/X56xx (IBRS update)
Stepping: 1
CPU MHz: 2933.438
BogoMIPS: 5866.87
Virtualization: VT-x
Hypervisor vendor: KVM
Virtualization type: full
L1d cache: 128 KiB
L1i cache: 128 KiB
L2 cache: 16 MiB
L3 cache: 64 MiB
NUMA node0 CPU(s): 0-3
Vulnerability L1tf: Mitigation; PTE Inversion; VMX SMT disabled, L1D conditional cache flushes
Vulnerability Meltdown: Mitigation; PTI
Vulnerability Spec store bypass: Mitigation; Speculative Store Bypass disabled via prctl and seccomp
Vulnerability Spectre v1: Mitigation; Load fences, __user pointer sanitization
Vulnerability Spectre v2: Mitigation; Full retpoline
Flags: fpu vme de pse tsc msr pae mce cx8 apic sep mtrr pge mca cmov pat pse36 clflush mmx fxsr sse sse2 ss syscall nx pdpe1gb rdtscp lm constant_tsc rep_good nopl xtopology eagerfpu pni pclmulqdq vmx ssse3 cx16 pcid sse4_1 sse4_2 x2apic popcnt tsc_deadline_timer aes hypervisor lahf_lm ssbd ibrs ibpb stibp tpr_shadow vnmi flexpriority ept vpid tsc_adjust arat spec_ctrl intel_stibp


---> nproc:
4


---> df -h:
Filesystem Size Used Available Use% Mounted on
overlay 50.0G 7.1G 42.9G 14% /
tmpfs 64.0M 0 64.0M 0% /dev
tmpfs 919.1M 0 919.1M 0% /sys/fs/cgroup
/dev/vda1 50.0G 7.1G 42.9G 14% /home/jenkins
shm 64.0M 0 64.0M 0% /dev/shm
/dev/vda1 50.0G 7.1G 42.9G 14% /etc/resolv.conf
/dev/vda1 50.0G 7.1G 42.9G 14% /etc/hostname
/dev/vda1 50.0G 7.1G 42.9G 14% /etc/hosts
/dev/vda1 50.0G 7.1G 42.9G 14% /var/log/sa
/dev/vda1 50.0G 7.1G 42.9G 14% <https://jenkins.edgexfoundry.org/job/device-grove-c-snap-master-stage-snap/ws/>
/dev/vda1 50.0G 7.1G 42.9G 14% <https://jenkins.edgexfoundry.org/job/device-grove-c-snap-master-stage-snap/ws/@tmp>


---> free -m:
total used free shared buff/cache available
Mem: 1838 682 111 0 1045 1074
Swap: 1023 1 1022


---> ip addr:
1: lo: <LOOPBACK,UP,LOWER_UP> mtu 65536 qdisc noqueue state UNKNOWN qlen 1000
link/loopback 00:00:00:00:00:00 brd 00:00:00:00:00:00
inet 127.0.0.1/8 scope host lo
valid_lft forever preferred_lft forever
10: eth0@if11: <BROADCAST,MULTICAST,UP,LOWER_UP,M-DOWN> mtu 1458 qdisc noqueue state UP
link/ether 02:42:0a:fa:00:01 brd ff:ff:ff:ff:ff:ff
inet 10.250.0.1/24 brd 10.250.0.255 scope global eth0
valid_lft forever preferred_lft forever


---> sar -b -r -n DEV:
Linux 3.10.0-862.14.4.el7.x86_64 (centos-7-docker-5bc7e375-1660-33dc-fe50-cb0f4dbfa1d5.vexxhost.ne) 02/24/20 _x86_64_ (4 CPU)

13:28:24 LINUX RESTART

13:29:01 tps rtps wtps bread/s bwrtn/s
13:30:01 200.50 13.91 186.58 2434.94 35318.23
13:31:01 601.01 433.09 167.92 23207.05 31343.85
13:32:01 286.44 104.74 181.69 5306.97 22915.44
13:33:01 67.69 18.56 49.13 1368.27 1339.35
13:34:01 114.72 56.32 58.40 4193.84 17572.79
Average: 254.09 125.25 128.83 7299.47 21716.97

13:29:01 kbmemfree kbmemused %memused kbbuffers kbcached kbcommit %commit kbactive kbinact kbdirty
13:30:01 75504 1806800 95.99 2620 1001688 1338744 45.68 491072 1036280 67464
13:31:01 101816 1780488 94.59 2348 1104008 1008388 34.41 591736 896892 74524
13:32:01 81012 1801292 95.70 2064 1015728 1171968 39.99 625572 917996 100
13:33:01 221276 1661028 88.24 2036 947880 1096576 37.41 513080 873780 15836
13:34:01 160996 1721308 91.45 2036 1062588 1000800 34.15 464508 993272 55892
Average: 128121 1754183 93.19 2221 1026378 1123295 38.33 537194 943644 42763

13:29:01 IFACE rxpck/s txpck/s rxkB/s txkB/s rxcmp/s txcmp/s rxmcst/s
13:30:01 vethb92198c 337.41 388.88 25.49 3891.99 0.00 0.00 0.00
13:30:01 eth0 782.83 574.83 4912.79 85.41 0.00 0.00 0.00
13:30:01 lo 0.10 0.10 0.01 0.01 0.00 0.00 0.00
13:30:01 docker0 337.41 388.75 20.88 3891.98 0.00 0.00 0.00
13:31:01 eth0 0.93 0.70 0.17 0.17 0.00 0.00 0.00
13:31:01 lo 0.00 0.00 0.00 0.00 0.00 0.00 0.00
13:31:01 docker0 0.00 0.00 0.00 0.00 0.00 0.00 0.00
13:32:01 eth0 249.99 193.64 2005.36 17.06 0.00 0.00 0.00
13:32:01 lo 0.00 0.00 0.00 0.00 0.00 0.00 0.00
13:32:01 veth6f8e884 180.51 233.95 13.56 2001.96 0.00 0.00 0.00
13:32:01 docker0 519.89 624.83 32.09 5916.60 0.00 0.00 0.00
13:33:01 eth0 53.57 48.21 150.84 6.97 0.00 0.00 0.00
13:33:01 lo 0.00 0.00 0.00 0.00 0.00 0.00 0.00
13:33:01 veth6f8e884 30.53 33.81 2.35 146.57 0.00 0.00 0.00
13:33:01 docker0 30.53 33.81 1.93 146.57 0.00 0.00 0.00
13:34:01 eth0 244.46 212.42 2614.57 27.25 0.00 0.00 0.00
13:34:01 lo 0.00 0.00 0.00 0.00 0.00 0.00 0.00
13:34:01 docker0 101.62 102.76 5.79 466.06 0.00 0.00 0.00
Average: eth0 224.59 183.49 1860.59 22.63 0.00 0.00 0.00
Average: lo 0.00 0.00 0.00 0.00 0.00 0.00 0.00
Average: docker0 130.25 152.10 7.95 1304.34 0.00 0.00 0.00


---> sar -P ALL:
Linux 3.10.0-862.14.4.el7.x86_64 (centos-7-docker-5bc7e375-1660-33dc-fe50-cb0f4dbfa1d5.vexxhost.ne) 02/24/20 _x86_64_ (4 CPU)

13:28:24 LINUX RESTART

13:29:01 CPU %user %nice %system %iowait %steal %idle
13:30:01 all 16.50 0.00 6.97 2.09 0.02 74.42
13:30:01 0 14.35 0.00 8.29 1.85 0.02 75.49
13:30:01 1 19.54 0.00 5.48 1.85 0.02 73.12
13:30:01 2 14.48 0.00 7.33 3.10 0.03 75.06
13:30:01 3 17.61 0.00 6.79 1.56 0.02 74.03
13:31:01 all 7.50 0.00 7.14 15.08 0.05 70.23
13:31:01 0 6.22 0.00 7.60 17.70 0.05 68.42
13:31:01 1 4.86 0.00 5.72 10.75 0.07 78.61
13:31:01 2 9.45 0.00 7.53 14.69 0.05 68.27
13:31:01 3 9.49 0.00 7.73 17.19 0.05 65.54
13:32:01 all 8.64 0.00 5.66 2.03 0.03 83.65
13:32:01 0 11.06 0.00 6.12 1.15 0.03 81.63
13:32:01 1 5.24 0.00 5.18 1.92 0.02 87.65
13:32:01 2 12.08 0.00 6.59 2.98 0.03 78.32
13:32:01 3 6.19 0.00 4.72 2.06 0.02 87.01
13:33:01 all 22.66 0.00 6.95 0.59 0.01 69.79
13:33:01 0 22.29 0.00 6.62 0.25 0.02 70.82
13:33:01 1 14.53 0.00 6.69 0.20 0.02 78.57
13:33:01 2 27.16 0.00 6.67 0.23 0.00 65.93
13:33:01 3 26.68 0.00 7.87 1.65 0.00 63.80
13:34:01 all 10.81 0.00 4.95 1.90 0.02 82.33
13:34:01 0 8.55 0.00 5.47 3.19 0.02 82.76
13:34:01 1 16.65 0.00 4.90 3.81 0.00 74.64
13:34:01 2 11.13 0.00 5.17 0.29 0.02 83.40
13:34:01 3 6.89 0.00 4.27 0.32 0.03 88.50
Average: all 13.24 0.00 6.33 4.31 0.02 76.09
Average: 0 12.52 0.00 6.82 4.81 0.03 75.82
Average: 1 12.19 0.00 5.59 3.69 0.02 78.51
Average: 2 14.88 0.00 6.66 4.23 0.03 74.21
Average: 3 13.40 0.00 6.27 4.50 0.02 75.80


-----END_OF_BUILD-----
Logs upload complete.
+ set +x
Build logs: <a href="https://logs.edgexfoundry.org/production/vex-yul-edgex-jenkins-1/device-grove-c-snap-master-stage-snap/240">https://logs.edgexfoundry.org/production/vex-yul-edgex-jenkins-1/device-grove-c-snap-master-stage-snap/240</a>
[description-setter] Description set: Build logs: <a href="https://logs.edgexfoundry.org/production/vex-yul-edgex-jenkins-1/device-grove-c-snap-master-stage-snap/240">https://logs.edgexfoundry.org/production/vex-yul-edgex-jenkins-1/device-grove-c-snap-master-stage-snap/240</a>

Build failed in Jenkins: device-mqtt-go-snap-master-stage-snap-arm #282 #jenkins

Jenkins <jenkins-donotreply@...>
 

See <https://jenkins.edgexfoundry.org/job/device-mqtt-go-snap-master-stage-snap-arm/282/display/redirect>

Changes:


------------------------------------------
[...truncated 44.07 KB...]
go: finding golang.org/x/sync v0.0.0-20181221193216-37e7f081c4d4
go: finding github.com/pascaldekloe/goe v0.0.0-20180627143212-57f6aae5913c
go: finding golang.org/x/crypto v0.0.0-20181029021203-45a5f77698d3
go: finding github.com/hashicorp/go-sockaddr v1.0.0
go: finding github.com/hashicorp/go-immutable-radix v1.0.0
go: finding github.com/bgentry/speakeasy v0.1.0
go: finding github.com/mattn/go-isatty v0.0.3
go: finding github.com/fatih/color v1.7.0
go: finding github.com/posener/complete v1.1.1
go: finding github.com/hashicorp/go.net v0.0.1
go: finding github.com/google/btree v0.0.0-20180813153112-4030bb1f1f0c
go: finding github.com/armon/go-radix v0.0.0-20180808171621-7fddfc383310
go: finding github.com/mattn/go-colorable v0.0.9
go: finding github.com/miekg/dns v1.0.14
go: finding github.com/hashicorp/golang-lru v0.5.0
go: finding github.com/hashicorp/go-uuid v1.0.0
go: finding github.com/hashicorp/errwrap v1.0.0
go: finding golang.org/x/sys v0.0.0-20181026203630-95b1ffbd15a5
go: finding golang.org/x/sys v0.0.0-20180823144017-11551d06cbcc
go: downloading github.com/edgexfoundry/device-sdk-go v0.0.0-20191023171807-49a95f741ef7
go: downloading github.com/edgexfoundry/go-mod-core-contracts v0.1.31
go: downloading github.com/spf13/cast v1.3.0
go: downloading github.com/eclipse/paho.mqtt.golang v1.1.1
go: downloading gopkg.in/mgo.v2 v2.0.0-20180705113604-9856a29383ce
go: downloading golang.org/x/net v0.0.0-20190213061140-3a22650c66bd
go: downloading github.com/ugorji/go v1.1.4
go: downloading github.com/pelletier/go-toml v1.2.0
go: downloading github.com/google/uuid v1.1.1
go: downloading github.com/edgexfoundry/go-mod-registry v0.1.0
go: downloading github.com/gorilla/mux v1.7.0
go: downloading gopkg.in/yaml.v2 v2.2.2
go: downloading github.com/pkg/errors v0.8.1
go: downloading github.com/hashicorp/consul v1.4.2
go: downloading github.com/mitchellh/consulstructure v0.0.0-20190329231841-56fdc4d2da54
go: downloading github.com/go-kit/kit v0.8.0
go: downloading github.com/mitchellh/mapstructure v1.1.2
go: downloading github.com/cenkalti/backoff v2.1.1+incompatible
go: downloading github.com/mitchellh/copystructure v1.0.0
go: downloading github.com/mitchellh/reflectwalk v1.0.0
go: downloading github.com/go-logfmt/logfmt v0.4.0
go: downloading github.com/hashicorp/serf v0.8.2
go: downloading github.com/hashicorp/go-cleanhttp v0.5.0
go: downloading github.com/hashicorp/go-rootcerts v1.0.0
go: downloading github.com/armon/go-metrics v0.0.0-20180917152333-f0300d1749da
go: downloading github.com/hashicorp/go-immutable-radix v1.0.0
go: downloading github.com/hashicorp/golang-lru v0.5.0
CGO_ENABLED=0 GO111MODULE=on go build ./...
Skipping stage go (already ran)
Staging device-mqtt
Priming go
Priming device-mqtt
DEPRECATED: The 'version-script' keyword has been deprecated in favour of the 'snapcraftctl set-version' part scriptlet.
See http://snapcraft.io/docs/deprecation-notices/dn10 for more information.
Determining the version from the project repo (version-script).
cat: VERSION: No such file or directory
The version has been set to '-20200224+7630a44'
error: cannot validate snap "edgex-device-mqtt": invalid snap version "-20200224+7630a44": must start with an ASCII alphanumeric (and not '-')
Failed to verify directory to pack.
Build step 'Execute shell' marked build as failure
$ ssh-agent -k
unset SSH_AUTH_SOCK;
unset SSH_AGENT_PID;
echo Agent pid 2029 killed;
[ssh-agent] Stopped.
[PostBuildScript] - [INFO] Executing post build scripts.
[device-mqtt-go-snap] $ /bin/bash /tmp/jenkins8393365739338045597.sh
---> sysstat.sh
2020-02-24 12:17:47.893008 WARN puppetlabs.facter - could not locate a ruby library: facts requiring Ruby will not be resolved.
2020-02-24 12:17:48.284754 WARN puppetlabs.facter - could not locate a ruby library: facts requiring Ruby will not be resolved.
End of system activity file unexpected
[device-mqtt-go-snap] $ /bin/bash /tmp/jenkins1983114947364911384.sh
---> package-listing.sh
++ tr '[:upper:]' '[:lower:]'
++ facter osfamily
2020-02-24 12:17:48.806686 WARN puppetlabs.facter - could not locate a ruby library: facts requiring Ruby will not be resolved.
+ OS_FAMILY=debian
+ workspace=<https://jenkins.edgexfoundry.org/job/device-mqtt-go-snap-master-stage-snap-arm/ws/>
+ START_PACKAGES=/tmp/packages_start.txt
+ END_PACKAGES=/tmp/packages_end.txt
+ DIFF_PACKAGES=/tmp/packages_diff.txt
+ PACKAGES=/tmp/packages_start.txt
+ '[' <https://jenkins.edgexfoundry.org/job/device-mqtt-go-snap-master-stage-snap-arm/ws/> ']'
+ PACKAGES=/tmp/packages_end.txt
+ case "${OS_FAMILY}" in
+ dpkg -l
+ grep '^ii'
+ '[' -f /tmp/packages_start.txt ']'
+ '[' -f /tmp/packages_end.txt ']'
+ diff /tmp/packages_start.txt /tmp/packages_end.txt
+ '[' <https://jenkins.edgexfoundry.org/job/device-mqtt-go-snap-master-stage-snap-arm/ws/> ']'
+ mkdir -p <https://jenkins.edgexfoundry.org/job/device-mqtt-go-snap-master-stage-snap-arm/ws/archives/>
+ cp -f /tmp/packages_diff.txt /tmp/packages_end.txt /tmp/packages_start.txt <https://jenkins.edgexfoundry.org/job/device-mqtt-go-snap-master-stage-snap-arm/ws/archives/>
provisioning config files...
copy managed file [jenkins-log-archives-settings] to file:<https://jenkins.edgexfoundry.org/job/device-mqtt-go-snap-master-stage-snap-arm/ws/@tmp/config4704315854219567736tmp>
[device-mqtt-go-snap] $ /bin/bash /tmp/jenkins7293423501307333478.sh
---> edgex-infra-ship-logs.sh
Unable to find image 'nexus3.edgexfoundry.org:10003/edgex-lftools-log-publisher:aarch64' locally
aarch64: Pulling from edgex-lftools-log-publisher
cde5963f3b93: Pulling fs layer
1cf707181fc0: Pulling fs layer
ecc8062bd8ae: Pulling fs layer
f73053cda371: Pulling fs layer
21891ac9f69c: Pulling fs layer
91256cc9b400: Pulling fs layer
1bd1ff0e301d: Pulling fs layer
55838df30d5e: Pulling fs layer
fe38a35a6fa4: Pulling fs layer
736cb92344f5: Pulling fs layer
f73053cda371: Waiting
21891ac9f69c: Waiting
91256cc9b400: Waiting
1bd1ff0e301d: Waiting
55838df30d5e: Waiting
fe38a35a6fa4: Waiting
736cb92344f5: Waiting
1cf707181fc0: Verifying Checksum
1cf707181fc0: Download complete
f73053cda371: Verifying Checksum
f73053cda371: Download complete
cde5963f3b93: Verifying Checksum
cde5963f3b93: Download complete
21891ac9f69c: Verifying Checksum
21891ac9f69c: Download complete
1bd1ff0e301d: Verifying Checksum
1bd1ff0e301d: Download complete
cde5963f3b93: Pull complete
1cf707181fc0: Pull complete
55838df30d5e: Verifying Checksum
55838df30d5e: Download complete
fe38a35a6fa4: Verifying Checksum
fe38a35a6fa4: Download complete
736cb92344f5: Verifying Checksum
736cb92344f5: Download complete
ecc8062bd8ae: Verifying Checksum
ecc8062bd8ae: Download complete
91256cc9b400: Verifying Checksum
91256cc9b400: Download complete
ecc8062bd8ae: Pull complete
f73053cda371: Pull complete
21891ac9f69c: Pull complete
91256cc9b400: Pull complete
1bd1ff0e301d: Pull complete
55838df30d5e: Pull complete
fe38a35a6fa4: Pull complete
736cb92344f5: Pull complete
Digest: sha256:e038adae1539a751c2d66fc650b1ee2b29832e64e1c88087ccfc4b874f27da29
Status: Downloaded newer image for nexus3.edgexfoundry.org:10003/edgex-lftools-log-publisher:aarch64
---> create-netrc.sh
+ ARCHIVE_ARTIFACTS=
+ LOGS_SERVER=https://logs.edgexfoundry.org
+ '[' https://logs.edgexfoundry.org '==' None ]
+ NEXUS_URL=https://nexus.edgexfoundry.org
+ NEXUS_PATH=production/vex-yul-edgex-jenkins-1/device-mqtt-go-snap-master-stage-snap-arm/282
+ BUILD_URL=https://jenkins.edgexfoundry.org/job/device-mqtt-go-snap-master-stage-snap-arm/282/
+ lftools deploy archives -p https://nexus.edgexfoundry.org production/vex-yul-edgex-jenkins-1/device-mqtt-go-snap-master-stage-snap-arm/282 <https://jenkins.edgexfoundry.org/job/device-mqtt-go-snap-master-stage-snap-arm/ws/>
---> logs-deploy.sh
Archives upload complete.
+ lftools deploy logs https://nexus.edgexfoundry.org production/vex-yul-edgex-jenkins-1/device-mqtt-go-snap-master-stage-snap-arm/282 https://jenkins.edgexfoundry.org/job/device-mqtt-go-snap-master-stage-snap-arm/282/
---> uname -a:
Linux cab62a818f3e 4.15.0-38-generic #41-Ubuntu SMP Wed Oct 10 10:59:31 UTC 2018 aarch64 Linux


---> lscpu:
Architecture: aarch64
CPU op-mode(s): 64-bit
Byte Order: Little Endian
CPU(s): 2
On-line CPU(s) list: 0,1
Thread(s) per core: 1
Core(s) per socket: 2
Socket(s): 1
NUMA node(s): 1
Vendor ID: Cavium
Model: 1
Model name: ThunderX 88XX
Stepping: 0x1
BogoMIPS: 200.00
NUMA node0 CPU(s): 0,1
Flags: fp asimd evtstrm aes pmull sha1 sha2 crc32 cpuid


---> nproc:
2


---> df -h:
Filesystem Size Used Available Use% Mounted on
overlay 38.6G 6.1G 32.5G 16% /
tmpfs 64.0M 0 64.0M 0% /dev
tmpfs 3.9G 0 3.9G 0% /sys/fs/cgroup
/dev/vda1 38.6G 6.1G 32.5G 16% /home/jenkins
shm 64.0M 0 64.0M 0% /dev/shm
/dev/vda1 38.6G 6.1G 32.5G 16% /etc/resolv.conf
/dev/vda1 38.6G 6.1G 32.5G 16% /etc/hostname
/dev/vda1 38.6G 6.1G 32.5G 16% /etc/hosts
/dev/vda1 38.6G 6.1G 32.5G 16% /var/log/sa
/dev/vda1 38.6G 6.1G 32.5G 16% <https://jenkins.edgexfoundry.org/job/device-mqtt-go-snap-master-stage-snap-arm/ws/>
/dev/vda1 38.6G 6.1G 32.5G 16% <https://jenkins.edgexfoundry.org/job/device-mqtt-go-snap-master-stage-snap-arm/ws/@tmp>


---> free -m:
total used free shared buff/cache available
Mem: 7973 638 4521 0 2814 7324
Swap: 1023 0 1023


---> ip addr:
1: lo: <LOOPBACK,UP,LOWER_UP> mtu 65536 qdisc noqueue state UNKNOWN qlen 1000
link/loopback 00:00:00:00:00:00 brd 00:00:00:00:00:00
inet 127.0.0.1/8 scope host lo
valid_lft forever preferred_lft forever
10: eth0@if11: <BROADCAST,MULTICAST,UP,LOWER_UP,M-DOWN> mtu 1458 qdisc noqueue state UP
link/ether 02:42:0a:fa:00:01 brd ff:ff:ff:ff:ff:ff
inet 10.250.0.1/24 brd 10.250.0.255 scope global eth0
valid_lft forever preferred_lft forever


Invalid system activity file: /var/log/sa/sa24
File created by sar/sadc from sysstat version 11.6.1
Current sysstat version cannot read the format of this file (0x2173)
Traceback (most recent call last):
File "/usr/local/bin/lftools", line 8, in <module>
sys.exit(main())
File "/usr/local/lib/python3.8/site-packages/lftools/cli/__init__.py", line 110, in main
cli(obj={})
File "/usr/local/lib/python3.8/site-packages/click/core.py", line 764, in __call__
return self.main(*args, **kwargs)
File "/usr/local/lib/python3.8/site-packages/click/core.py", line 717, in main
rv = self.invoke(ctx)
File "/usr/local/lib/python3.8/site-packages/click/core.py", line 1137, in invoke
return _process_result(sub_ctx.command.invoke(sub_ctx))
File "/usr/local/lib/python3.8/site-packages/click/core.py", line 1137, in invoke
return _process_result(sub_ctx.command.invoke(sub_ctx))
File "/usr/local/lib/python3.8/site-packages/click/core.py", line 956, in invoke
return ctx.invoke(self.callback, **ctx.params)
File "/usr/local/lib/python3.8/site-packages/click/core.py", line 555, in invoke
return callback(*args, **kwargs)
File "/usr/local/lib/python3.8/site-packages/click/decorators.py", line 17, in new_func
return f(get_current_context(), *args, **kwargs)
File "/usr/local/lib/python3.8/site-packages/lftools/cli/deploy.py", line 139, in logs
deploy_sys.deploy_logs(nexus_url, nexus_path, build_url)
File "/usr/local/lib/python3.8/site-packages/lftools/deploy.py", line 293, in deploy_logs
output = subprocess.check_output(c).decode('utf-8')
File "/usr/local/lib/python3.8/subprocess.py", line 411, in check_output
return run(*popenargs, stdout=PIPE, timeout=timeout, check=True,
File "/usr/local/lib/python3.8/subprocess.py", line 512, in run
raise CalledProcessError(retcode, process.args,
subprocess.CalledProcessError: Command '['sar', '-b', '-r', '-n', 'DEV']' returned non-zero exit status 3.
[description-setter] Could not determine description.

Build failed in Jenkins: device-mqtt-go-snap-master-stage-snap #282 #jenkins

Jenkins <jenkins-donotreply@...>
 

See <https://jenkins.edgexfoundry.org/job/device-mqtt-go-snap-master-stage-snap/282/display/redirect>

Changes:


------------------------------------------
[...truncated 39.85 KB...]
Dload Upload Total Spent Left Speed
0 0 0 0 0 0 0 0 --:--:-- --:--:-- --:--:-- 0 5 115M 5 6511k 0 0 12.0M 0 0:00:09 --:--:-- 0:00:09 12.0M
curl: (56) OpenSSL SSL_read: SSL_ERROR_SYSCALL, errno 104
Failed to run 'override-build': Exit code was 56.
Build step 'Execute shell' marked build as failure
$ ssh-agent -k
unset SSH_AUTH_SOCK;
unset SSH_AGENT_PID;
echo Agent pid 9135 killed;
[ssh-agent] Stopped.
[PostBuildScript] - [INFO] Executing post build scripts.
[device-mqtt-go-snap] $ /bin/bash /tmp/jenkins3304575918055956499.sh
---> sysstat.sh
[device-mqtt-go-snap] $ /bin/bash /tmp/jenkins1954106119322639145.sh
---> package-listing.sh
++ tr '[:upper:]' '[:lower:]'
++ facter osfamily
+ OS_FAMILY=redhat
+ workspace=<https://jenkins.edgexfoundry.org/job/device-mqtt-go-snap-master-stage-snap/ws/>
+ START_PACKAGES=/tmp/packages_start.txt
+ END_PACKAGES=/tmp/packages_end.txt
+ DIFF_PACKAGES=/tmp/packages_diff.txt
+ PACKAGES=/tmp/packages_start.txt
+ '[' <https://jenkins.edgexfoundry.org/job/device-mqtt-go-snap-master-stage-snap/ws/> ']'
+ PACKAGES=/tmp/packages_end.txt
+ case "${OS_FAMILY}" in
+ rpm -qa
+ sort
+ '[' -f /tmp/packages_start.txt ']'
+ '[' -f /tmp/packages_end.txt ']'
+ diff /tmp/packages_start.txt /tmp/packages_end.txt
+ '[' <https://jenkins.edgexfoundry.org/job/device-mqtt-go-snap-master-stage-snap/ws/> ']'
+ mkdir -p <https://jenkins.edgexfoundry.org/job/device-mqtt-go-snap-master-stage-snap/ws/archives/>
+ cp -f /tmp/packages_diff.txt /tmp/packages_end.txt /tmp/packages_start.txt <https://jenkins.edgexfoundry.org/job/device-mqtt-go-snap-master-stage-snap/ws/archives/>
provisioning config files...
copy managed file [jenkins-log-archives-settings] to file:<https://jenkins.edgexfoundry.org/job/device-mqtt-go-snap-master-stage-snap/ws/@tmp/config3909563964974041243tmp>
[device-mqtt-go-snap] $ /bin/bash /tmp/jenkins8430746676403254685.sh
---> edgex-infra-ship-logs.sh
Unable to find image 'nexus3.edgexfoundry.org:10003/edgex-lftools-log-publisher:x86_64' locally
x86_64: Pulling from edgex-lftools-log-publisher
e6b0cf9c0882: Pulling fs layer
da0e9bf0cc60: Pulling fs layer
c9ea274ed700: Pulling fs layer
9cfac6ba3733: Pulling fs layer
f6a933c9cadc: Pulling fs layer
61811dbd4963: Pulling fs layer
a6eb2c9e2280: Pulling fs layer
095dd8b7b4d8: Pulling fs layer
dc21a1d4508b: Pulling fs layer
363af2e989c4: Pulling fs layer
61811dbd4963: Waiting
a6eb2c9e2280: Waiting
095dd8b7b4d8: Waiting
dc21a1d4508b: Waiting
363af2e989c4: Waiting
9cfac6ba3733: Waiting
f6a933c9cadc: Waiting
da0e9bf0cc60: Verifying Checksum
da0e9bf0cc60: Download complete
9cfac6ba3733: Download complete
e6b0cf9c0882: Verifying Checksum
e6b0cf9c0882: Download complete
f6a933c9cadc: Verifying Checksum
f6a933c9cadc: Download complete
a6eb2c9e2280: Verifying Checksum
a6eb2c9e2280: Download complete
e6b0cf9c0882: Pull complete
da0e9bf0cc60: Pull complete
c9ea274ed700: Verifying Checksum
c9ea274ed700: Download complete
095dd8b7b4d8: Verifying Checksum
095dd8b7b4d8: Download complete
dc21a1d4508b: Verifying Checksum
dc21a1d4508b: Download complete
363af2e989c4: Verifying Checksum
363af2e989c4: Download complete
61811dbd4963: Verifying Checksum
61811dbd4963: Download complete
c9ea274ed700: Pull complete
9cfac6ba3733: Pull complete
f6a933c9cadc: Pull complete
61811dbd4963: Pull complete
a6eb2c9e2280: Pull complete
095dd8b7b4d8: Pull complete
dc21a1d4508b: Pull complete
363af2e989c4: Pull complete
Digest: sha256:add8188b58b49eaf945790de1a8bc2588125c85e750a42d0a8acc29426f6ed5f
Status: Downloaded newer image for nexus3.edgexfoundry.org:10003/edgex-lftools-log-publisher:x86_64
---> create-netrc.sh
---> logs-deploy.sh
+ ARCHIVE_ARTIFACTS=
+ LOGS_SERVER=https://logs.edgexfoundry.org
+ '[' https://logs.edgexfoundry.org '==' None ]
+ NEXUS_URL=https://nexus.edgexfoundry.org
+ NEXUS_PATH=production/vex-yul-edgex-jenkins-1/device-mqtt-go-snap-master-stage-snap/282
+ BUILD_URL=https://jenkins.edgexfoundry.org/job/device-mqtt-go-snap-master-stage-snap/282/
+ lftools deploy archives -p https://nexus.edgexfoundry.org production/vex-yul-edgex-jenkins-1/device-mqtt-go-snap-master-stage-snap/282 <https://jenkins.edgexfoundry.org/job/device-mqtt-go-snap-master-stage-snap/ws/>
Archives upload complete.
+ lftools deploy logs https://nexus.edgexfoundry.org production/vex-yul-edgex-jenkins-1/device-mqtt-go-snap-master-stage-snap/282 https://jenkins.edgexfoundry.org/job/device-mqtt-go-snap-master-stage-snap/282/
---> uname -a:
Linux ce2cc710b32a 3.10.0-862.14.4.el7.x86_64 #1 SMP Wed Sep 26 15:12:11 UTC 2018 x86_64 Linux


---> lscpu:
Architecture: x86_64
CPU op-mode(s): 32-bit, 64-bit
Byte Order: Little Endian
Address sizes: 40 bits physical, 48 bits virtual
CPU(s): 4
On-line CPU(s) list: 0-3
Thread(s) per core: 1
Core(s) per socket: 1
Socket(s): 4
NUMA node(s): 1
Vendor ID: GenuineIntel
CPU family: 6
Model: 44
Model name: Westmere E56xx/L56xx/X56xx (IBRS update)
Stepping: 1
CPU MHz: 2933.438
BogoMIPS: 5866.87
Virtualization: VT-x
Hypervisor vendor: KVM
Virtualization type: full
L1d cache: 128 KiB
L1i cache: 128 KiB
L2 cache: 16 MiB
L3 cache: 64 MiB
NUMA node0 CPU(s): 0-3
Vulnerability L1tf: Mitigation; PTE Inversion; VMX SMT disabled, L1D conditional cache flushes
Vulnerability Meltdown: Mitigation; PTI
Vulnerability Spec store bypass: Mitigation; Speculative Store Bypass disabled via prctl and seccomp
Vulnerability Spectre v1: Mitigation; Load fences, __user pointer sanitization
Vulnerability Spectre v2: Mitigation; Full retpoline
Flags: fpu vme de pse tsc msr pae mce cx8 apic sep mtrr pge mca cmov pat pse36 clflush mmx fxsr sse sse2 ss syscall nx pdpe1gb rdtscp lm constant_tsc rep_good nopl xtopology eagerfpu pni pclmulqdq vmx ssse3 cx16 pcid sse4_1 sse4_2 x2apic popcnt tsc_deadline_timer aes hypervisor lahf_lm ssbd ibrs ibpb stibp tpr_shadow vnmi flexpriority ept vpid tsc_adjust arat spec_ctrl intel_stibp


---> nproc:
4


---> df -h:
Filesystem Size Used Available Use% Mounted on
overlay 50.0G 7.1G 42.9G 14% /
tmpfs 64.0M 0 64.0M 0% /dev
tmpfs 919.1M 0 919.1M 0% /sys/fs/cgroup
/dev/vda1 50.0G 7.1G 42.9G 14% /home/jenkins
shm 64.0M 0 64.0M 0% /dev/shm
/dev/vda1 50.0G 7.1G 42.9G 14% /etc/resolv.conf
/dev/vda1 50.0G 7.1G 42.9G 14% /etc/hostname
/dev/vda1 50.0G 7.1G 42.9G 14% /etc/hosts
/dev/vda1 50.0G 7.1G 42.9G 14% /var/log/sa
/dev/vda1 50.0G 7.1G 42.9G 14% <https://jenkins.edgexfoundry.org/job/device-mqtt-go-snap-master-stage-snap/ws/>
/dev/vda1 50.0G 7.1G 42.9G 14% <https://jenkins.edgexfoundry.org/job/device-mqtt-go-snap-master-stage-snap/ws/@tmp>


---> free -m:
total used free shared buff/cache available
Mem: 1838 671 84 0 1082 1082
Swap: 1023 1 1022


---> ip addr:
1: lo: <LOOPBACK,UP,LOWER_UP> mtu 65536 qdisc noqueue state UNKNOWN qlen 1000
link/loopback 00:00:00:00:00:00 brd 00:00:00:00:00:00
inet 127.0.0.1/8 scope host lo
valid_lft forever preferred_lft forever
10: eth0@if11: <BROADCAST,MULTICAST,UP,LOWER_UP,M-DOWN> mtu 1458 qdisc noqueue state UP
link/ether 02:42:0a:fa:00:01 brd ff:ff:ff:ff:ff:ff
inet 10.250.0.1/24 brd 10.250.0.255 scope global eth0
valid_lft forever preferred_lft forever


---> sar -b -r -n DEV:
Linux 3.10.0-862.14.4.el7.x86_64 (centos-7-docker-5bc7e375-1660-33dc-fe50-cb0f4dbfa1d5.vexxhost.ne) 02/24/20 _x86_64_ (4 CPU)

09:09:39 LINUX RESTART

09:10:02 tps rtps wtps bread/s bwrtn/s
09:11:01 145.65 50.34 95.32 5457.86 38414.76
09:12:01 215.32 45.03 170.28 3577.56 35692.33
09:13:01 532.00 380.82 151.18 19503.03 27263.03
09:14:01 250.81 118.48 132.33 7486.01 21116.75
Average: 286.84 149.38 137.46 9035.00 30582.49

09:10:02 kbmemfree kbmemused %memused kbbuffers kbcached kbcommit %commit kbactive kbinact kbdirty
09:11:01 65784 1816520 96.51 2620 1237076 1106656 37.76 474360 1177420 103392
09:12:01 146136 1736168 92.24 2588 1100976 1083844 36.98 366592 1107532 91152
09:13:01 81236 1801068 95.68 2100 1115448 1104144 37.67 585584 922736 93516
09:14:01 75176 1807128 96.01 1892 1147264 1131236 38.60 526760 1021536 95064
Average: 92083 1790221 95.11 2300 1150191 1106470 37.75 488324 1057306 95781

09:10:02 IFACE rxpck/s txpck/s rxkB/s txkB/s rxcmp/s txcmp/s rxmcst/s
09:11:01 veth62a69f2 43.41 54.65 3.06 389.24 0.00 0.00 0.00
09:11:01 eth0 291.53 202.20 1433.78 58.07 0.00 0.00 0.00
09:11:01 lo 0.10 0.10 0.01 0.01 0.00 0.00 0.00
09:11:01 docker0 43.41 54.51 2.47 389.23 0.00 0.00 0.00
09:12:01 eth0 298.14 215.68 3531.47 15.47 0.00 0.00 0.00
09:12:01 lo 0.00 0.00 0.00 0.00 0.00 0.00 0.00
09:12:01 docker0 212.29 293.01 11.81 3530.42 0.00 0.00 0.00
09:13:01 eth0 0.08 0.08 0.01 0.01 0.00 0.00 0.00
09:13:01 lo 0.00 0.00 0.00 0.00 0.00 0.00 0.00
09:13:01 docker0 0.00 0.00 0.00 0.00 0.00 0.00 0.00
09:14:01 eth0 142.98 119.98 2494.20 21.18 0.00 0.00 0.00
09:14:01 lo 0.00 0.00 0.00 0.00 0.00 0.00 0.00
09:14:01 docker0 41.47 47.98 2.36 352.43 0.00 0.00 0.00
Average: eth0 175.47 131.19 1854.30 23.24 0.00 0.00 0.00
Average: lo 0.00 0.00 0.00 0.00 0.00 0.00 0.00
Average: docker0 74.28 98.88 4.16 1068.75 0.00 0.00 0.00


---> sar -P ALL:
Linux 3.10.0-862.14.4.el7.x86_64 (centos-7-docker-5bc7e375-1660-33dc-fe50-cb0f4dbfa1d5.vexxhost.ne) 02/24/20 _x86_64_ (4 CPU)

09:09:39 LINUX RESTART

09:10:02 CPU %user %nice %system %iowait %steal %idle
09:11:01 all 15.07 0.00 7.84 5.84 16.30 54.95
09:11:01 0 15.08 0.00 7.51 5.97 17.36 54.08
09:11:01 1 11.23 0.00 6.12 9.06 16.92 56.66
09:11:01 2 18.60 0.00 11.62 3.71 15.32 50.75
09:11:01 3 15.53 0.00 6.15 4.49 15.60 58.23
09:12:01 all 10.83 0.00 4.86 1.32 5.21 77.79
09:12:01 0 9.61 0.00 4.80 1.49 7.34 76.76
09:12:01 1 11.57 0.00 5.61 1.91 4.29 76.63
09:12:01 2 9.37 0.00 3.25 1.23 4.65 81.49
09:12:01 3 12.77 0.00 5.79 0.66 4.52 76.25
09:13:01 all 4.10 0.00 4.31 15.00 9.52 67.08
09:13:01 0 3.33 0.00 3.58 12.70 9.18 71.21
09:13:01 1 4.99 0.00 5.24 17.63 9.96 62.18
09:13:01 2 3.72 0.00 3.82 14.50 8.56 69.40
09:13:01 3 4.38 0.00 4.61 15.23 10.40 65.38
09:14:01 all 8.74 0.00 4.79 2.73 9.18 74.56
09:14:01 0 5.13 0.00 4.12 2.14 9.53 79.08
09:14:01 1 14.13 0.00 5.66 5.59 9.60 65.03
09:14:01 2 5.32 0.00 4.01 1.13 8.87 80.67
09:14:01 3 10.58 0.00 5.41 2.12 8.72 73.17
Average: all 9.61 0.00 5.43 6.28 10.01 68.67
Average: 0 8.18 0.00 4.97 5.64 10.80 70.42
Average: 1 10.45 0.00 5.66 8.60 10.21 65.09
Average: 2 9.11 0.00 5.60 5.20 9.28 70.82
Average: 3 10.74 0.00 5.48 5.69 9.75 68.34


-----END_OF_BUILD-----
Logs upload complete.
+ set +x
Build logs: <a href="https://logs.edgexfoundry.org/production/vex-yul-edgex-jenkins-1/device-mqtt-go-snap-master-stage-snap/282">https://logs.edgexfoundry.org/production/vex-yul-edgex-jenkins-1/device-mqtt-go-snap-master-stage-snap/282</a>
[description-setter] Description set: Build logs: <a href="https://logs.edgexfoundry.org/production/vex-yul-edgex-jenkins-1/device-mqtt-go-snap-master-stage-snap/282">https://logs.edgexfoundry.org/production/vex-yul-edgex-jenkins-1/device-mqtt-go-snap-master-stage-snap/282</a>

Build failed in Jenkins: device-grove-c-snap-master-stage-snap-arm #240 #jenkins

Jenkins <jenkins-donotreply@...>
 

See <https://jenkins.edgexfoundry.org/job/device-grove-c-snap-master-stage-snap-arm/240/display/redirect>

Changes:


------------------------------------------
[...truncated 137.04 KB...]
edgex_device_svcparams params = { GROVE_SVC, NULL, NULL, NULL };
^~~~~~~~~~~~~~~~~~~~~~
edgex_device_stop
In file included from /build/parts/edgex-device-grove/src/src/c/main.c:14:0:
/build/parts/edgex-device-grove/src/src/c/device_grove.h:39:19: warning: initialization makes integer from pointer without a cast [-Wint-conversion]
#define GROVE_SVC "Device-Grove"
^
/build/parts/edgex-device-grove/src/src/c/main.c:725:37: note: in expansion of macro ‘GROVE_SVC’
edgex_device_svcparams params = { GROVE_SVC, NULL, NULL, NULL };
^~~~~~~~~
/build/parts/edgex-device-grove/src/src/c/device_grove.h:39:19: note: (near initialization for ‘params’)
#define GROVE_SVC "Device-Grove"
^
/build/parts/edgex-device-grove/src/src/c/main.c:725:37: note: in expansion of macro ‘GROVE_SVC’
edgex_device_svcparams params = { GROVE_SVC, NULL, NULL, NULL };
^~~~~~~~~
/build/parts/edgex-device-grove/src/src/c/main.c:725:48: warning: excess elements in scalar initializer
edgex_device_svcparams params = { GROVE_SVC, NULL, NULL, NULL };
^~~~
/build/parts/edgex-device-grove/src/src/c/main.c:725:48: note: (near initialization for ‘params’)
/build/parts/edgex-device-grove/src/src/c/main.c:725:54: warning: excess elements in scalar initializer
edgex_device_svcparams params = { GROVE_SVC, NULL, NULL, NULL };
^~~~
/build/parts/edgex-device-grove/src/src/c/main.c:725:54: note: (near initialization for ‘params’)
/build/parts/edgex-device-grove/src/src/c/main.c:725:60: warning: excess elements in scalar initializer
edgex_device_svcparams params = { GROVE_SVC, NULL, NULL, NULL };
^~~~
/build/parts/edgex-device-grove/src/src/c/main.c:725:60: note: (near initialization for ‘params’)
/build/parts/edgex-device-grove/src/src/c/main.c:731:8: warning: implicit declaration of function ‘edgex_device_service_processparams’; did you mean ‘edgex_device_service_start’? [-Wimplicit-function-declaration]
if (!edgex_device_service_processparams (&argc, argv, &params))
^~~~~~~~~~~~~~~~~~~~~~~~~~~~~~~~~~
edgex_device_service_start
/build/parts/edgex-device-grove/src/src/c/main.c:743:7: warning: implicit declaration of function ‘edgex_device_service_usage’; did you mean ‘edgex_device_service_free’? [-Wimplicit-function-declaration]
edgex_device_service_usage ();
^~~~~~~~~~~~~~~~~~~~~~~~~~
edgex_device_service_free
/build/parts/edgex-device-grove/src/src/c/main.c:766:73: error: request for member ‘svcname’ in something not a structure or union
edgex_device_service *grove_service = edgex_device_service_new (params.svcname, GROVE_VERSION, implObject, myImpls, &err);
^
/build/parts/edgex-device-grove/src/src/c/main.c:771:52: error: request for member ‘regURL’ in something not a structure or union
edgex_device_service_start (grove_service, params.regURL, params.profile, params.confdir, &err);
^
/build/parts/edgex-device-grove/src/src/c/main.c:771:67: error: request for member ‘profile’ in something not a structure or union
edgex_device_service_start (grove_service, params.regURL, params.profile, params.confdir, &err);
^
/build/parts/edgex-device-grove/src/src/c/main.c:771:83: error: request for member ‘confdir’ in something not a structure or union
edgex_device_service_start (grove_service, params.regURL, params.profile, params.confdir, &err);
^
make[2]: *** [CMakeFiles/device-grove.dir/main.c.o] Error 1
CMakeFiles/device-grove.dir/build.make:134: recipe for target 'CMakeFiles/device-grove.dir/main.c.o' failed
make[1]: *** [CMakeFiles/device-grove.dir/all] Error 2
CMakeFiles/Makefile2:67: recipe for target 'CMakeFiles/device-grove.dir/all' failed
Makefile:129: recipe for target 'all' failed
make: *** [all] Error 2
cmake /build/parts/edgex-device-grove/src/src/c -DCMAKE_INSTALL_PREFIX= -DCMAKE_BUILD_TYPE=Release
cmake --build . -- -j2
Failed to run 'cmake --build . -- -j2' for 'edgex-device-grove': Exited with code 2.
Verify that the part is using the correct parameters and try again.
Build step 'Execute shell' marked build as failure
$ ssh-agent -k
unset SSH_AUTH_SOCK;
unset SSH_AGENT_PID;
echo Agent pid 1984 killed;
[ssh-agent] Stopped.
[PostBuildScript] - [INFO] Executing post build scripts.
[device-grove-c-snap] $ /bin/bash /tmp/jenkins4438390398336955911.sh
---> sysstat.sh
2020-02-24 06:41:09.982226 WARN puppetlabs.facter - could not locate a ruby library: facts requiring Ruby will not be resolved.
2020-02-24 06:41:10.371928 WARN puppetlabs.facter - could not locate a ruby library: facts requiring Ruby will not be resolved.
End of system activity file unexpected
[device-grove-c-snap] $ /bin/bash /tmp/jenkins3274733714865606452.sh
---> package-listing.sh
++ facter osfamily
++ tr '[:upper:]' '[:lower:]'
2020-02-24 06:41:10.907184 WARN puppetlabs.facter - could not locate a ruby library: facts requiring Ruby will not be resolved.
+ OS_FAMILY=debian
+ workspace=<https://jenkins.edgexfoundry.org/job/device-grove-c-snap-master-stage-snap-arm/ws/>
+ START_PACKAGES=/tmp/packages_start.txt
+ END_PACKAGES=/tmp/packages_end.txt
+ DIFF_PACKAGES=/tmp/packages_diff.txt
+ PACKAGES=/tmp/packages_start.txt
+ '[' <https://jenkins.edgexfoundry.org/job/device-grove-c-snap-master-stage-snap-arm/ws/> ']'
+ PACKAGES=/tmp/packages_end.txt
+ case "${OS_FAMILY}" in
+ dpkg -l
+ grep '^ii'
+ '[' -f /tmp/packages_start.txt ']'
+ '[' -f /tmp/packages_end.txt ']'
+ diff /tmp/packages_start.txt /tmp/packages_end.txt
+ '[' <https://jenkins.edgexfoundry.org/job/device-grove-c-snap-master-stage-snap-arm/ws/> ']'
+ mkdir -p <https://jenkins.edgexfoundry.org/job/device-grove-c-snap-master-stage-snap-arm/ws/archives/>
+ cp -f /tmp/packages_diff.txt /tmp/packages_end.txt /tmp/packages_start.txt <https://jenkins.edgexfoundry.org/job/device-grove-c-snap-master-stage-snap-arm/ws/archives/>
provisioning config files...
copy managed file [jenkins-log-archives-settings] to file:<https://jenkins.edgexfoundry.org/job/device-grove-c-snap-master-stage-snap-arm/ws/@tmp/config937067410314012555tmp>
[device-grove-c-snap] $ /bin/bash /tmp/jenkins6773709555856403897.sh
---> edgex-infra-ship-logs.sh
Unable to find image 'nexus3.edgexfoundry.org:10003/edgex-lftools-log-publisher:aarch64' locally
aarch64: Pulling from edgex-lftools-log-publisher
cde5963f3b93: Pulling fs layer
1cf707181fc0: Pulling fs layer
ecc8062bd8ae: Pulling fs layer
f73053cda371: Pulling fs layer
21891ac9f69c: Pulling fs layer
91256cc9b400: Pulling fs layer
1bd1ff0e301d: Pulling fs layer
55838df30d5e: Pulling fs layer
fe38a35a6fa4: Pulling fs layer
736cb92344f5: Pulling fs layer
f73053cda371: Waiting
21891ac9f69c: Waiting
91256cc9b400: Waiting
1bd1ff0e301d: Waiting
55838df30d5e: Waiting
fe38a35a6fa4: Waiting
736cb92344f5: Waiting
1cf707181fc0: Verifying Checksum
1cf707181fc0: Download complete
f73053cda371: Verifying Checksum
f73053cda371: Download complete
cde5963f3b93: Verifying Checksum
cde5963f3b93: Download complete
21891ac9f69c: Verifying Checksum
21891ac9f69c: Download complete
1bd1ff0e301d: Verifying Checksum
1bd1ff0e301d: Download complete
cde5963f3b93: Pull complete
1cf707181fc0: Pull complete
55838df30d5e: Verifying Checksum
55838df30d5e: Download complete
fe38a35a6fa4: Verifying Checksum
fe38a35a6fa4: Download complete
736cb92344f5: Verifying Checksum
736cb92344f5: Download complete
ecc8062bd8ae: Verifying Checksum
ecc8062bd8ae: Download complete
91256cc9b400: Verifying Checksum
91256cc9b400: Download complete
ecc8062bd8ae: Pull complete
f73053cda371: Pull complete
21891ac9f69c: Pull complete
91256cc9b400: Pull complete
1bd1ff0e301d: Pull complete
55838df30d5e: Pull complete
fe38a35a6fa4: Pull complete
736cb92344f5: Pull complete
Digest: sha256:e038adae1539a751c2d66fc650b1ee2b29832e64e1c88087ccfc4b874f27da29
Status: Downloaded newer image for nexus3.edgexfoundry.org:10003/edgex-lftools-log-publisher:aarch64
---> create-netrc.sh
---> logs-deploy.sh
+ ARCHIVE_ARTIFACTS=
+ LOGS_SERVER=https://logs.edgexfoundry.org
+ '[' https://logs.edgexfoundry.org '==' None ]
+ NEXUS_URL=https://nexus.edgexfoundry.org
+ NEXUS_PATH=production/vex-yul-edgex-jenkins-1/device-grove-c-snap-master-stage-snap-arm/240
+ BUILD_URL=https://jenkins.edgexfoundry.org/job/device-grove-c-snap-master-stage-snap-arm/240/
+ lftools deploy archives -p https://nexus.edgexfoundry.org production/vex-yul-edgex-jenkins-1/device-grove-c-snap-master-stage-snap-arm/240 <https://jenkins.edgexfoundry.org/job/device-grove-c-snap-master-stage-snap-arm/ws/>
Archives upload complete.
+ lftools deploy logs https://nexus.edgexfoundry.org production/vex-yul-edgex-jenkins-1/device-grove-c-snap-master-stage-snap-arm/240 https://jenkins.edgexfoundry.org/job/device-grove-c-snap-master-stage-snap-arm/240/
---> uname -a:
Linux 369be6b395ca 4.15.0-38-generic #41-Ubuntu SMP Wed Oct 10 10:59:31 UTC 2018 aarch64 Linux


---> lscpu:
Architecture: aarch64
CPU op-mode(s): 64-bit
Byte Order: Little Endian
CPU(s): 2
On-line CPU(s) list: 0,1
Thread(s) per core: 1
Core(s) per socket: 2
Socket(s): 1
NUMA node(s): 1
Vendor ID: Cavium
Model: 1
Model name: ThunderX 88XX
Stepping: 0x1
BogoMIPS: 200.00
NUMA node0 CPU(s): 0,1
Flags: fp asimd evtstrm aes pmull sha1 sha2 crc32 cpuid


---> nproc:
2


---> df -h:
Filesystem Size Used Available Use% Mounted on
overlay 38.6G 6.1G 32.5G 16% /
tmpfs 64.0M 0 64.0M 0% /dev
tmpfs 3.9G 0 3.9G 0% /sys/fs/cgroup
/dev/vda1 38.6G 6.1G 32.5G 16% /home/jenkins
shm 64.0M 0 64.0M 0% /dev/shm
/dev/vda1 38.6G 6.1G 32.5G 16% /etc/resolv.conf
/dev/vda1 38.6G 6.1G 32.5G 16% /etc/hostname
/dev/vda1 38.6G 6.1G 32.5G 16% /etc/hosts
/dev/vda1 38.6G 6.1G 32.5G 16% /var/log/sa
/dev/vda1 38.6G 6.1G 32.5G 16% <https://jenkins.edgexfoundry.org/job/device-grove-c-snap-master-stage-snap-arm/ws/>
/dev/vda1 38.6G 6.1G 32.5G 16% <https://jenkins.edgexfoundry.org/job/device-grove-c-snap-master-stage-snap-arm/ws/@tmp>


---> free -m:
total used free shared buff/cache available
Mem: 7973 649 4504 0 2820 7321
Swap: 1023 0 1023


---> ip addr:
1: lo: <LOOPBACK,UP,LOWER_UP> mtu 65536 qdisc noqueue state UNKNOWN qlen 1000
link/loopback 00:00:00:00:00:00 brd 00:00:00:00:00:00
inet 127.0.0.1/8 scope host lo
valid_lft forever preferred_lft forever
10: eth0@if11: <BROADCAST,MULTICAST,UP,LOWER_UP,M-DOWN> mtu 1458 qdisc noqueue state UP
link/ether 02:42:0a:fa:00:01 brd ff:ff:ff:ff:ff:ff
inet 10.250.0.1/24 brd 10.250.0.255 scope global eth0
valid_lft forever preferred_lft forever


Invalid system activity file: /var/log/sa/sa24
File created by sar/sadc from sysstat version 11.6.1
Current sysstat version cannot read the format of this file (0x2173)
Traceback (most recent call last):
File "/usr/local/bin/lftools", line 8, in <module>
sys.exit(main())
File "/usr/local/lib/python3.8/site-packages/lftools/cli/__init__.py", line 110, in main
cli(obj={})
File "/usr/local/lib/python3.8/site-packages/click/core.py", line 764, in __call__
return self.main(*args, **kwargs)
File "/usr/local/lib/python3.8/site-packages/click/core.py", line 717, in main
rv = self.invoke(ctx)
File "/usr/local/lib/python3.8/site-packages/click/core.py", line 1137, in invoke
return _process_result(sub_ctx.command.invoke(sub_ctx))
File "/usr/local/lib/python3.8/site-packages/click/core.py", line 1137, in invoke
return _process_result(sub_ctx.command.invoke(sub_ctx))
File "/usr/local/lib/python3.8/site-packages/click/core.py", line 956, in invoke
return ctx.invoke(self.callback, **ctx.params)
File "/usr/local/lib/python3.8/site-packages/click/core.py", line 555, in invoke
return callback(*args, **kwargs)
File "/usr/local/lib/python3.8/site-packages/click/decorators.py", line 17, in new_func
return f(get_current_context(), *args, **kwargs)
File "/usr/local/lib/python3.8/site-packages/lftools/cli/deploy.py", line 139, in logs
deploy_sys.deploy_logs(nexus_url, nexus_path, build_url)
File "/usr/local/lib/python3.8/site-packages/lftools/deploy.py", line 293, in deploy_logs
output = subprocess.check_output(c).decode('utf-8')
File "/usr/local/lib/python3.8/subprocess.py", line 411, in check_output
return run(*popenargs, stdout=PIPE, timeout=timeout, check=True,
File "/usr/local/lib/python3.8/subprocess.py", line 512, in run
raise CalledProcessError(retcode, process.args,
subprocess.CalledProcessError: Command '['sar', '-b', '-r', '-n', 'DEV']' returned non-zero exit status 3.
[description-setter] Could not determine description.

Build failed in Jenkins: edgex-ui-go-snap-master-stage-snap-arm #257 #jenkins

Jenkins <jenkins-donotreply@...>
 

See <https://jenkins.edgexfoundry.org/job/edgex-ui-go-snap-master-stage-snap-arm/257/display/redirect>

Changes:


------------------------------------------
[...truncated 65.31 KB...]
readline-common set to automatically installed.
xauth set to automatically installed.
xz-utils set to automatically installed.
The following snaps are required but not installed as snapcraft is running inside docker or podman container: core18.
Please ensure the environment is properly setup before continuing.
Ignore this message if the appropriate measures have already been taken
Pulling go
'edgex-ui-go' has dependencies that need to be staged: go
Skipping pull go (already ran)
Building go
% Total % Received % Xferd Average Speed Time Time Time Current
Dload Upload Total Spent Left Speed
0 0 0 0 0 0 0 0 --:--:-- --:--:-- --:--:-- 0 28 94.3M 28 26.9M 0 0 37.1M 0 0:00:02 --:--:-- 0:00:02 37.1M 82 94.3M 82 77.4M 0 0 44.7M 0 0:00:02 0:00:01 0:00:01 44.7M100 94.3M 100 94.3M 0 0 44.9M 0 0:00:02 0:00:02 --:--:-- 44.9M
go1.11.9.linux-arm64.tar.gz: OK
Staging go
Pulling edgex-ui-go
Pulling local-snap-assets
Pulling web-static
Skipping build go (already ran)
Building edgex-ui-go
CGO_ENABLED=0 GO111MODULE=on go build -ldflags "-X github.com/edgexfoundry/edgex-ui-go.Version=0.0.0" -o cmd/edgex-ui-server/edgex-ui-server ./cmd/edgex-ui-server
go: finding github.com/eclipse/paho.mqtt.golang v1.2.0
go: finding github.com/gorilla/websocket v1.4.0
go: finding github.com/kr/pretty v0.1.0
go: finding github.com/BurntSushi/toml v0.3.1
go: finding github.com/gorilla/mux v1.7.1
go: finding golang.org/x/net v0.0.0-20190419010253-1f3472d942ba
go: finding gopkg.in/check.v1 v1.0.0-20180628173108-788fd7840127
go: finding gopkg.in/mgo.v2 v2.0.0-20180705113604-9856a29383ce
go: finding github.com/kr/text v0.1.0
go: finding github.com/kr/pty v1.1.1
go: finding golang.org/x/text v0.3.0
go: finding golang.org/x/crypto v0.0.0-20190308221718-c2843e01d9a2
go: finding golang.org/x/sys v0.0.0-20190215142949-d0b11bdaac8a
go: downloading github.com/gorilla/mux v1.7.1
go: downloading gopkg.in/mgo.v2 v2.0.0-20180705113604-9856a29383ce
go: downloading github.com/BurntSushi/toml v0.3.1
go: downloading github.com/eclipse/paho.mqtt.golang v1.2.0
go: downloading github.com/gorilla/websocket v1.4.0
go: downloading golang.org/x/net v0.0.0-20190419010253-1f3472d942ba
CGO_ENABLED=0 GO111MODULE=on go build ./...
Building local-snap-assets
Building web-static
Skipping stage go (already ran)
Staging edgex-ui-go
Staging local-snap-assets
Staging web-static
Priming go
Priming edgex-ui-go
Priming local-snap-assets
Priming web-static
DEPRECATED: The 'version-script' keyword has been deprecated in favour of the 'snapcraftctl set-version' part scriptlet.
See http://snapcraft.io/docs/deprecation-notices/dn10 for more information.
Determining the version from the project repo (version-script).
cat: VERSION: No such file or directory
The version has been set to '-20200224+1b60ac1'
error: cannot validate snap "edgex-ui-go": invalid snap version "-20200224+1b60ac1": must start with an ASCII alphanumeric (and not '-')
Failed to verify directory to pack.
Build step 'Execute shell' marked build as failure
$ ssh-agent -k
unset SSH_AUTH_SOCK;
unset SSH_AGENT_PID;
echo Agent pid 1938 killed;
[ssh-agent] Stopped.
[PostBuildScript] - [INFO] Executing post build scripts.
[edgex-ui-go-snap] $ /bin/bash /tmp/jenkins2576579804848843847.sh
---> sysstat.sh
2020-02-24 06:17:43.955390 WARN puppetlabs.facter - could not locate a ruby library: facts requiring Ruby will not be resolved.
2020-02-24 06:17:44.349620 WARN puppetlabs.facter - could not locate a ruby library: facts requiring Ruby will not be resolved.
End of system activity file unexpected
[edgex-ui-go-snap] $ /bin/bash /tmp/jenkins8703079232424671215.sh
---> package-listing.sh
++ facter osfamily
++ tr '[:upper:]' '[:lower:]'
2020-02-24 06:17:44.908591 WARN puppetlabs.facter - could not locate a ruby library: facts requiring Ruby will not be resolved.
+ OS_FAMILY=debian
+ workspace=<https://jenkins.edgexfoundry.org/job/edgex-ui-go-snap-master-stage-snap-arm/ws/>
+ START_PACKAGES=/tmp/packages_start.txt
+ END_PACKAGES=/tmp/packages_end.txt
+ DIFF_PACKAGES=/tmp/packages_diff.txt
+ PACKAGES=/tmp/packages_start.txt
+ '[' <https://jenkins.edgexfoundry.org/job/edgex-ui-go-snap-master-stage-snap-arm/ws/> ']'
+ PACKAGES=/tmp/packages_end.txt
+ case "${OS_FAMILY}" in
+ grep '^ii'
+ dpkg -l
+ '[' -f /tmp/packages_start.txt ']'
+ '[' -f /tmp/packages_end.txt ']'
+ diff /tmp/packages_start.txt /tmp/packages_end.txt
+ '[' <https://jenkins.edgexfoundry.org/job/edgex-ui-go-snap-master-stage-snap-arm/ws/> ']'
+ mkdir -p <https://jenkins.edgexfoundry.org/job/edgex-ui-go-snap-master-stage-snap-arm/ws/archives/>
+ cp -f /tmp/packages_diff.txt /tmp/packages_end.txt /tmp/packages_start.txt <https://jenkins.edgexfoundry.org/job/edgex-ui-go-snap-master-stage-snap-arm/ws/archives/>
provisioning config files...
copy managed file [jenkins-log-archives-settings] to file:<https://jenkins.edgexfoundry.org/job/edgex-ui-go-snap-master-stage-snap-arm/ws/@tmp/config304392967610295811tmp>
[edgex-ui-go-snap] $ /bin/bash /tmp/jenkins2442588800337324176.sh
---> edgex-infra-ship-logs.sh
Unable to find image 'nexus3.edgexfoundry.org:10003/edgex-lftools-log-publisher:aarch64' locally
aarch64: Pulling from edgex-lftools-log-publisher
cde5963f3b93: Pulling fs layer
1cf707181fc0: Pulling fs layer
ecc8062bd8ae: Pulling fs layer
f73053cda371: Pulling fs layer
21891ac9f69c: Pulling fs layer
91256cc9b400: Pulling fs layer
1bd1ff0e301d: Pulling fs layer
55838df30d5e: Pulling fs layer
fe38a35a6fa4: Pulling fs layer
736cb92344f5: Pulling fs layer
f73053cda371: Waiting
21891ac9f69c: Waiting
91256cc9b400: Waiting
55838df30d5e: Waiting
fe38a35a6fa4: Waiting
736cb92344f5: Waiting
1bd1ff0e301d: Waiting
1cf707181fc0: Verifying Checksum
1cf707181fc0: Download complete
f73053cda371: Verifying Checksum
f73053cda371: Download complete
cde5963f3b93: Verifying Checksum
cde5963f3b93: Download complete
21891ac9f69c: Verifying Checksum
21891ac9f69c: Download complete
1bd1ff0e301d: Verifying Checksum
1bd1ff0e301d: Download complete
cde5963f3b93: Pull complete
1cf707181fc0: Pull complete
55838df30d5e: Verifying Checksum
55838df30d5e: Download complete
fe38a35a6fa4: Verifying Checksum
fe38a35a6fa4: Download complete
736cb92344f5: Verifying Checksum
736cb92344f5: Download complete
ecc8062bd8ae: Verifying Checksum
ecc8062bd8ae: Download complete
91256cc9b400: Verifying Checksum
91256cc9b400: Download complete
ecc8062bd8ae: Pull complete
f73053cda371: Pull complete
21891ac9f69c: Pull complete
91256cc9b400: Pull complete
1bd1ff0e301d: Pull complete
55838df30d5e: Pull complete
fe38a35a6fa4: Pull complete
736cb92344f5: Pull complete
Digest: sha256:e038adae1539a751c2d66fc650b1ee2b29832e64e1c88087ccfc4b874f27da29
Status: Downloaded newer image for nexus3.edgexfoundry.org:10003/edgex-lftools-log-publisher:aarch64
---> create-netrc.sh
---> logs-deploy.sh
+ ARCHIVE_ARTIFACTS=
+ LOGS_SERVER=https://logs.edgexfoundry.org
+ '[' https://logs.edgexfoundry.org '==' None ]
+ NEXUS_URL=https://nexus.edgexfoundry.org
+ NEXUS_PATH=production/vex-yul-edgex-jenkins-1/edgex-ui-go-snap-master-stage-snap-arm/257
+ BUILD_URL=https://jenkins.edgexfoundry.org/job/edgex-ui-go-snap-master-stage-snap-arm/257/
+ lftools deploy archives -p https://nexus.edgexfoundry.org production/vex-yul-edgex-jenkins-1/edgex-ui-go-snap-master-stage-snap-arm/257 <https://jenkins.edgexfoundry.org/job/edgex-ui-go-snap-master-stage-snap-arm/ws/>
Archives upload complete.
+ lftools deploy logs https://nexus.edgexfoundry.org production/vex-yul-edgex-jenkins-1/edgex-ui-go-snap-master-stage-snap-arm/257 https://jenkins.edgexfoundry.org/job/edgex-ui-go-snap-master-stage-snap-arm/257/
---> uname -a:
Linux 95979b4b8bea 4.15.0-38-generic #41-Ubuntu SMP Wed Oct 10 10:59:31 UTC 2018 aarch64 Linux


---> lscpu:
Architecture: aarch64
CPU op-mode(s): 64-bit
Byte Order: Little Endian
CPU(s): 2
On-line CPU(s) list: 0,1
Thread(s) per core: 1
Core(s) per socket: 2
Socket(s): 1
NUMA node(s): 1
Vendor ID: Cavium
Model: 1
Model name: ThunderX 88XX
Stepping: 0x1
BogoMIPS: 200.00
NUMA node0 CPU(s): 0,1
Flags: fp asimd evtstrm aes pmull sha1 sha2 crc32 cpuid


---> nproc:
2


---> df -h:
Filesystem Size Used Available Use% Mounted on
overlay 38.6G 6.1G 32.5G 16% /
tmpfs 64.0M 0 64.0M 0% /dev
tmpfs 3.9G 0 3.9G 0% /sys/fs/cgroup
/dev/vda1 38.6G 6.1G 32.5G 16% /home/jenkins
shm 64.0M 0 64.0M 0% /dev/shm
/dev/vda1 38.6G 6.1G 32.5G 16% /etc/resolv.conf
/dev/vda1 38.6G 6.1G 32.5G 16% /etc/hostname
/dev/vda1 38.6G 6.1G 32.5G 16% /etc/hosts
/dev/vda1 38.6G 6.1G 32.5G 16% /var/log/sa
/dev/vda1 38.6G 6.1G 32.5G 16% <https://jenkins.edgexfoundry.org/job/edgex-ui-go-snap-master-stage-snap-arm/ws/@tmp>
/dev/vda1 38.6G 6.1G 32.5G 16% <https://jenkins.edgexfoundry.org/job/edgex-ui-go-snap-master-stage-snap-arm/ws/>


---> free -m:
total used free shared buff/cache available
Mem: 7973 650 4489 0 2833 7317
Swap: 1023 0 1023


---> ip addr:
1: lo: <LOOPBACK,UP,LOWER_UP> mtu 65536 qdisc noqueue state UNKNOWN qlen 1000
link/loopback 00:00:00:00:00:00 brd 00:00:00:00:00:00
inet 127.0.0.1/8 scope host lo
valid_lft forever preferred_lft forever
10: eth0@if11: <BROADCAST,MULTICAST,UP,LOWER_UP,M-DOWN> mtu 1458 qdisc noqueue state UP
link/ether 02:42:0a:fa:00:01 brd ff:ff:ff:ff:ff:ff
inet 10.250.0.1/24 brd 10.250.0.255 scope global eth0
valid_lft forever preferred_lft forever


Invalid system activity file: /var/log/sa/sa24
File created by sar/sadc from sysstat version 11.6.1
Current sysstat version cannot read the format of this file (0x2173)
Traceback (most recent call last):
File "/usr/local/bin/lftools", line 8, in <module>
sys.exit(main())
File "/usr/local/lib/python3.8/site-packages/lftools/cli/__init__.py", line 110, in main
cli(obj={})
File "/usr/local/lib/python3.8/site-packages/click/core.py", line 764, in __call__
return self.main(*args, **kwargs)
File "/usr/local/lib/python3.8/site-packages/click/core.py", line 717, in main
rv = self.invoke(ctx)
File "/usr/local/lib/python3.8/site-packages/click/core.py", line 1137, in invoke
return _process_result(sub_ctx.command.invoke(sub_ctx))
File "/usr/local/lib/python3.8/site-packages/click/core.py", line 1137, in invoke
return _process_result(sub_ctx.command.invoke(sub_ctx))
File "/usr/local/lib/python3.8/site-packages/click/core.py", line 956, in invoke
return ctx.invoke(self.callback, **ctx.params)
File "/usr/local/lib/python3.8/site-packages/click/core.py", line 555, in invoke
return callback(*args, **kwargs)
File "/usr/local/lib/python3.8/site-packages/click/decorators.py", line 17, in new_func
return f(get_current_context(), *args, **kwargs)
File "/usr/local/lib/python3.8/site-packages/lftools/cli/deploy.py", line 139, in logs
deploy_sys.deploy_logs(nexus_url, nexus_path, build_url)
File "/usr/local/lib/python3.8/site-packages/lftools/deploy.py", line 293, in deploy_logs
output = subprocess.check_output(c).decode('utf-8')
File "/usr/local/lib/python3.8/subprocess.py", line 411, in check_output
return run(*popenargs, stdout=PIPE, timeout=timeout, check=True,
File "/usr/local/lib/python3.8/subprocess.py", line 512, in run
raise CalledProcessError(retcode, process.args,
subprocess.CalledProcessError: Command '['sar', '-b', '-r', '-n', 'DEV']' returned non-zero exit status 3.
[description-setter] Could not determine description.

Build failed in Jenkins: device-modbus-go-snap-master-stage-snap-arm #282 #jenkins

Jenkins <jenkins-donotreply@...>
 

See <https://jenkins.edgexfoundry.org/job/device-modbus-go-snap-master-stage-snap-arm/282/display/redirect>

Changes:


------------------------------------------
[...truncated 44.09 KB...]
go: finding github.com/hashicorp/go-immutable-radix v1.0.0
go: finding golang.org/x/net v0.0.0-20181201002055-351d144fa1fc
go: finding github.com/gorilla/mux v1.6.2
go: finding github.com/pascaldekloe/goe v0.0.0-20180627143212-57f6aae5913c
go: finding github.com/posener/complete v1.1.1
go: finding github.com/hashicorp/go-sockaddr v1.0.0
go: finding github.com/miekg/dns v1.0.14
go: finding github.com/sean-/seed v0.0.0-20170313163322-e2103e2c3529
go: finding github.com/mitchellh/iochan v1.0.0
go: finding github.com/hashicorp/go-uuid v1.0.0
go: finding github.com/ryanuber/columnize v0.0.0-20160712163229-9b3edd62028f
go: finding golang.org/x/net v0.0.0-20181023162649-9b4f9f5ad519
go: finding github.com/google/btree v0.0.0-20180813153112-4030bb1f1f0c
go: finding github.com/mitchellh/reflectwalk v1.0.0
go: finding github.com/hashicorp/golang-lru v0.5.0
go: finding github.com/hashicorp/go.net v0.0.1
go: finding golang.org/x/sync v0.0.0-20181221193216-37e7f081c4d4
go: finding github.com/mitchellh/mapstructure v1.1.2
go: finding github.com/stretchr/testify v1.2.2
go: finding golang.org/x/crypto v0.0.0-20181029021203-45a5f77698d3
go: downloading github.com/edgexfoundry/go-mod-core-contracts v0.1.31
go: downloading github.com/goburrow/modbus v0.1.0
go: downloading github.com/edgexfoundry/device-sdk-go v0.0.0-20191023171807-49a95f741ef7
go: downloading github.com/goburrow/serial v0.1.0
go: downloading github.com/ugorji/go v1.1.4
go: downloading github.com/google/uuid v1.1.1
go: downloading github.com/pelletier/go-toml v1.2.0
go: downloading github.com/pkg/errors v0.8.1
go: downloading github.com/edgexfoundry/go-mod-registry v0.1.0
go: downloading github.com/go-kit/kit v0.8.0
go: downloading github.com/gorilla/mux v1.7.0
go: downloading gopkg.in/yaml.v2 v2.2.2
go: downloading github.com/hashicorp/consul v1.4.2
go: downloading github.com/mitchellh/consulstructure v0.0.0-20190329231841-56fdc4d2da54
go: downloading github.com/mitchellh/copystructure v1.0.0
go: downloading github.com/cenkalti/backoff v2.1.1+incompatible
go: downloading github.com/mitchellh/mapstructure v1.1.2
go: downloading github.com/mitchellh/reflectwalk v1.0.0
go: downloading github.com/go-logfmt/logfmt v0.4.0
go: downloading github.com/hashicorp/go-cleanhttp v0.5.0
go: downloading github.com/hashicorp/go-rootcerts v1.0.0
go: downloading github.com/hashicorp/serf v0.8.2
go: downloading github.com/armon/go-metrics v0.0.0-20180917152333-f0300d1749da
go: downloading github.com/hashicorp/go-immutable-radix v1.0.0
go: downloading github.com/hashicorp/golang-lru v0.5.1
CGO_ENABLED=0 GO111MODULE=on go build ./...
go: downloading github.com/tbrandon/mbserver v0.0.0-20170611213546-993e1772cc62
Skipping stage go (already ran)
Staging device-modbus
Priming go
Priming device-modbus
DEPRECATED: The 'version-script' keyword has been deprecated in favour of the 'snapcraftctl set-version' part scriptlet.
See http://snapcraft.io/docs/deprecation-notices/dn10 for more information.
Determining the version from the project repo (version-script).
cat: VERSION: No such file or directory
The version has been set to '-20200224+f8002f6'
error: cannot validate snap "edgex-device-modbus": invalid snap version "-20200224+f8002f6": must start with an ASCII alphanumeric (and not '-')
Failed to verify directory to pack.
Build step 'Execute shell' marked build as failure
$ ssh-agent -k
unset SSH_AUTH_SOCK;
unset SSH_AGENT_PID;
echo Agent pid 2015 killed;
[ssh-agent] Stopped.
[PostBuildScript] - [INFO] Executing post build scripts.
[device-modbus-go-snap] $ /bin/bash /tmp/jenkins8780576230211784267.sh
---> sysstat.sh
2020-02-24 04:50:59.575055 WARN puppetlabs.facter - could not locate a ruby library: facts requiring Ruby will not be resolved.
2020-02-24 04:51:00.010875 WARN puppetlabs.facter - could not locate a ruby library: facts requiring Ruby will not be resolved.
End of system activity file unexpected
[device-modbus-go-snap] $ /bin/bash /tmp/jenkins316912298416424073.sh
---> package-listing.sh
++ facter osfamily
++ tr '[:upper:]' '[:lower:]'
2020-02-24 04:51:00.601467 WARN puppetlabs.facter - could not locate a ruby library: facts requiring Ruby will not be resolved.
+ OS_FAMILY=debian
+ workspace=<https://jenkins.edgexfoundry.org/job/device-modbus-go-snap-master-stage-snap-arm/ws/>
+ START_PACKAGES=/tmp/packages_start.txt
+ END_PACKAGES=/tmp/packages_end.txt
+ DIFF_PACKAGES=/tmp/packages_diff.txt
+ PACKAGES=/tmp/packages_start.txt
+ '[' <https://jenkins.edgexfoundry.org/job/device-modbus-go-snap-master-stage-snap-arm/ws/> ']'
+ PACKAGES=/tmp/packages_end.txt
+ case "${OS_FAMILY}" in
+ grep '^ii'
+ dpkg -l
+ '[' -f /tmp/packages_start.txt ']'
+ '[' -f /tmp/packages_end.txt ']'
+ diff /tmp/packages_start.txt /tmp/packages_end.txt
+ '[' <https://jenkins.edgexfoundry.org/job/device-modbus-go-snap-master-stage-snap-arm/ws/> ']'
+ mkdir -p <https://jenkins.edgexfoundry.org/job/device-modbus-go-snap-master-stage-snap-arm/ws/archives/>
+ cp -f /tmp/packages_diff.txt /tmp/packages_end.txt /tmp/packages_start.txt <https://jenkins.edgexfoundry.org/job/device-modbus-go-snap-master-stage-snap-arm/ws/archives/>
provisioning config files...
copy managed file [jenkins-log-archives-settings] to file:<https://jenkins.edgexfoundry.org/job/device-modbus-go-snap-master-stage-snap-arm/ws/@tmp/config8968749970844718130tmp>
[device-modbus-go-snap] $ /bin/bash /tmp/jenkins1788122480509704422.sh
---> edgex-infra-ship-logs.sh
Unable to find image 'nexus3.edgexfoundry.org:10003/edgex-lftools-log-publisher:aarch64' locally
aarch64: Pulling from edgex-lftools-log-publisher
cde5963f3b93: Pulling fs layer
1cf707181fc0: Pulling fs layer
ecc8062bd8ae: Pulling fs layer
f73053cda371: Pulling fs layer
21891ac9f69c: Pulling fs layer
91256cc9b400: Pulling fs layer
1bd1ff0e301d: Pulling fs layer
55838df30d5e: Pulling fs layer
fe38a35a6fa4: Pulling fs layer
736cb92344f5: Pulling fs layer
f73053cda371: Waiting
1bd1ff0e301d: Waiting
55838df30d5e: Waiting
fe38a35a6fa4: Waiting
736cb92344f5: Waiting
21891ac9f69c: Waiting
91256cc9b400: Waiting
1cf707181fc0: Verifying Checksum
1cf707181fc0: Download complete
f73053cda371: Verifying Checksum
f73053cda371: Download complete
cde5963f3b93: Verifying Checksum
cde5963f3b93: Download complete
21891ac9f69c: Verifying Checksum
21891ac9f69c: Download complete
1bd1ff0e301d: Verifying Checksum
1bd1ff0e301d: Download complete
cde5963f3b93: Pull complete
1cf707181fc0: Pull complete
55838df30d5e: Verifying Checksum
55838df30d5e: Download complete
fe38a35a6fa4: Verifying Checksum
fe38a35a6fa4: Download complete
736cb92344f5: Verifying Checksum
736cb92344f5: Download complete
ecc8062bd8ae: Verifying Checksum
ecc8062bd8ae: Download complete
91256cc9b400: Verifying Checksum
91256cc9b400: Download complete
ecc8062bd8ae: Pull complete
f73053cda371: Pull complete
21891ac9f69c: Pull complete
91256cc9b400: Pull complete
1bd1ff0e301d: Pull complete
55838df30d5e: Pull complete
fe38a35a6fa4: Pull complete
736cb92344f5: Pull complete
Digest: sha256:e038adae1539a751c2d66fc650b1ee2b29832e64e1c88087ccfc4b874f27da29
Status: Downloaded newer image for nexus3.edgexfoundry.org:10003/edgex-lftools-log-publisher:aarch64
---> create-netrc.sh
+ ARCHIVE_ARTIFACTS=
---> logs-deploy.sh
+ LOGS_SERVER=https://logs.edgexfoundry.org
+ '[' https://logs.edgexfoundry.org '==' None ]
+ NEXUS_URL=https://nexus.edgexfoundry.org
+ NEXUS_PATH=production/vex-yul-edgex-jenkins-1/device-modbus-go-snap-master-stage-snap-arm/282
+ BUILD_URL=https://jenkins.edgexfoundry.org/job/device-modbus-go-snap-master-stage-snap-arm/282/
+ lftools deploy archives -p https://nexus.edgexfoundry.org production/vex-yul-edgex-jenkins-1/device-modbus-go-snap-master-stage-snap-arm/282 <https://jenkins.edgexfoundry.org/job/device-modbus-go-snap-master-stage-snap-arm/ws/>
Archives upload complete.
+ lftools deploy logs https://nexus.edgexfoundry.org production/vex-yul-edgex-jenkins-1/device-modbus-go-snap-master-stage-snap-arm/282 https://jenkins.edgexfoundry.org/job/device-modbus-go-snap-master-stage-snap-arm/282/
---> uname -a:
Linux d02ff77514e7 4.15.0-38-generic #41-Ubuntu SMP Wed Oct 10 10:59:31 UTC 2018 aarch64 Linux


---> lscpu:
Architecture: aarch64
CPU op-mode(s): 64-bit
Byte Order: Little Endian
CPU(s): 2
On-line CPU(s) list: 0,1
Thread(s) per core: 1
Core(s) per socket: 2
Socket(s): 1
NUMA node(s): 1
Vendor ID: Cavium
Model: 1
Model name: ThunderX 88XX
Stepping: 0x1
BogoMIPS: 200.00
NUMA node0 CPU(s): 0,1
Flags: fp asimd evtstrm aes pmull sha1 sha2 crc32 cpuid


---> nproc:
2


---> df -h:
Filesystem Size Used Available Use% Mounted on
overlay 38.6G 6.1G 32.5G 16% /
tmpfs 64.0M 0 64.0M 0% /dev
tmpfs 3.9G 0 3.9G 0% /sys/fs/cgroup
/dev/vda1 38.6G 6.1G 32.5G 16% /home/jenkins
shm 64.0M 0 64.0M 0% /dev/shm
/dev/vda1 38.6G 6.1G 32.5G 16% /etc/resolv.conf
/dev/vda1 38.6G 6.1G 32.5G 16% /etc/hostname
/dev/vda1 38.6G 6.1G 32.5G 16% /etc/hosts
/dev/vda1 38.6G 6.1G 32.5G 16% /var/log/sa
/dev/vda1 38.6G 6.1G 32.5G 16% <https://jenkins.edgexfoundry.org/job/device-modbus-go-snap-master-stage-snap-arm/ws/>
/dev/vda1 38.6G 6.1G 32.5G 16% <https://jenkins.edgexfoundry.org/job/device-modbus-go-snap-master-stage-snap-arm/ws/@tmp>


---> free -m:
total used free shared buff/cache available
Mem: 7973 643 4512 0 2818 7319
Swap: 1023 0 1023


---> ip addr:
1: lo: <LOOPBACK,UP,LOWER_UP> mtu 65536 qdisc noqueue state UNKNOWN qlen 1000
link/loopback 00:00:00:00:00:00 brd 00:00:00:00:00:00
inet 127.0.0.1/8 scope host lo
valid_lft forever preferred_lft forever
10: eth0@if11: <BROADCAST,MULTICAST,UP,LOWER_UP,M-DOWN> mtu 1458 qdisc noqueue state UP
link/ether 02:42:0a:fa:00:01 brd ff:ff:ff:ff:ff:ff
inet 10.250.0.1/24 brd 10.250.0.255 scope global eth0
valid_lft forever preferred_lft forever


Invalid system activity file: /var/log/sa/sa24
File created by sar/sadc from sysstat version 11.6.1
Current sysstat version cannot read the format of this file (0x2173)
Traceback (most recent call last):
File "/usr/local/bin/lftools", line 8, in <module>
sys.exit(main())
File "/usr/local/lib/python3.8/site-packages/lftools/cli/__init__.py", line 110, in main
cli(obj={})
File "/usr/local/lib/python3.8/site-packages/click/core.py", line 764, in __call__
return self.main(*args, **kwargs)
File "/usr/local/lib/python3.8/site-packages/click/core.py", line 717, in main
rv = self.invoke(ctx)
File "/usr/local/lib/python3.8/site-packages/click/core.py", line 1137, in invoke
return _process_result(sub_ctx.command.invoke(sub_ctx))
File "/usr/local/lib/python3.8/site-packages/click/core.py", line 1137, in invoke
return _process_result(sub_ctx.command.invoke(sub_ctx))
File "/usr/local/lib/python3.8/site-packages/click/core.py", line 956, in invoke
return ctx.invoke(self.callback, **ctx.params)
File "/usr/local/lib/python3.8/site-packages/click/core.py", line 555, in invoke
return callback(*args, **kwargs)
File "/usr/local/lib/python3.8/site-packages/click/decorators.py", line 17, in new_func
return f(get_current_context(), *args, **kwargs)
File "/usr/local/lib/python3.8/site-packages/lftools/cli/deploy.py", line 139, in logs
deploy_sys.deploy_logs(nexus_url, nexus_path, build_url)
File "/usr/local/lib/python3.8/site-packages/lftools/deploy.py", line 293, in deploy_logs
output = subprocess.check_output(c).decode('utf-8')
File "/usr/local/lib/python3.8/subprocess.py", line 411, in check_output
return run(*popenargs, stdout=PIPE, timeout=timeout, check=True,
File "/usr/local/lib/python3.8/subprocess.py", line 512, in run
raise CalledProcessError(retcode, process.args,
subprocess.CalledProcessError: Command '['sar', '-b', '-r', '-n', 'DEV']' returned non-zero exit status 3.
[description-setter] Could not determine description.

Build failed in Jenkins: device-grove-c-snap-fuji-stage-snap #102 #jenkins

Jenkins <jenkins-donotreply@...>
 

See <https://jenkins.edgexfoundry.org/job/device-grove-c-snap-fuji-stage-snap/102/display/redirect>

Changes:


------------------------------------------
[...truncated 141.93 KB...]
---> sysstat.sh
[device-grove-c-snap] $ /bin/bash /tmp/jenkins6088475694943863318.sh
---> package-listing.sh
++ facter osfamily
++ tr '[:upper:]' '[:lower:]'
+ OS_FAMILY=redhat
+ workspace=<https://jenkins.edgexfoundry.org/job/device-grove-c-snap-fuji-stage-snap/ws/>
+ START_PACKAGES=/tmp/packages_start.txt
+ END_PACKAGES=/tmp/packages_end.txt
+ DIFF_PACKAGES=/tmp/packages_diff.txt
+ PACKAGES=/tmp/packages_start.txt
+ '[' <https://jenkins.edgexfoundry.org/job/device-grove-c-snap-fuji-stage-snap/ws/> ']'
+ PACKAGES=/tmp/packages_end.txt
+ case "${OS_FAMILY}" in
+ rpm -qa
+ sort
+ '[' -f /tmp/packages_start.txt ']'
+ '[' -f /tmp/packages_end.txt ']'
+ diff /tmp/packages_start.txt /tmp/packages_end.txt
+ '[' <https://jenkins.edgexfoundry.org/job/device-grove-c-snap-fuji-stage-snap/ws/> ']'
+ mkdir -p <https://jenkins.edgexfoundry.org/job/device-grove-c-snap-fuji-stage-snap/ws/archives/>
+ cp -f /tmp/packages_diff.txt /tmp/packages_end.txt /tmp/packages_start.txt <https://jenkins.edgexfoundry.org/job/device-grove-c-snap-fuji-stage-snap/ws/archives/>
provisioning config files...
copy managed file [jenkins-log-archives-settings] to file:<https://jenkins.edgexfoundry.org/job/device-grove-c-snap-fuji-stage-snap/ws/@tmp/config4849919530572275639tmp>
[device-grove-c-snap] $ /bin/bash /tmp/jenkins7782752377290892929.sh
---> edgex-infra-ship-logs.sh
Unable to find image 'nexus3.edgexfoundry.org:10003/edgex-lftools-log-publisher:x86_64' locally
x86_64: Pulling from edgex-lftools-log-publisher
e6b0cf9c0882: Pulling fs layer
da0e9bf0cc60: Pulling fs layer
c9ea274ed700: Pulling fs layer
9cfac6ba3733: Pulling fs layer
f6a933c9cadc: Pulling fs layer
61811dbd4963: Pulling fs layer
a6eb2c9e2280: Pulling fs layer
095dd8b7b4d8: Pulling fs layer
dc21a1d4508b: Pulling fs layer
363af2e989c4: Pulling fs layer
a6eb2c9e2280: Waiting
095dd8b7b4d8: Waiting
dc21a1d4508b: Waiting
363af2e989c4: Waiting
9cfac6ba3733: Waiting
f6a933c9cadc: Waiting
61811dbd4963: Waiting
da0e9bf0cc60: Verifying Checksum
da0e9bf0cc60: Download complete
9cfac6ba3733: Verifying Checksum
9cfac6ba3733: Download complete
e6b0cf9c0882: Verifying Checksum
e6b0cf9c0882: Download complete
f6a933c9cadc: Verifying Checksum
f6a933c9cadc: Download complete
a6eb2c9e2280: Download complete
c9ea274ed700: Verifying Checksum
c9ea274ed700: Download complete
095dd8b7b4d8: Verifying Checksum
095dd8b7b4d8: Download complete
363af2e989c4: Verifying Checksum
363af2e989c4: Download complete
dc21a1d4508b: Verifying Checksum
dc21a1d4508b: Download complete
e6b0cf9c0882: Pull complete
da0e9bf0cc60: Pull complete
61811dbd4963: Verifying Checksum
61811dbd4963: Download complete
c9ea274ed700: Pull complete
9cfac6ba3733: Pull complete
f6a933c9cadc: Pull complete
61811dbd4963: Pull complete
a6eb2c9e2280: Pull complete
095dd8b7b4d8: Pull complete
dc21a1d4508b: Pull complete
363af2e989c4: Pull complete
Digest: sha256:add8188b58b49eaf945790de1a8bc2588125c85e750a42d0a8acc29426f6ed5f
Status: Downloaded newer image for nexus3.edgexfoundry.org:10003/edgex-lftools-log-publisher:x86_64
---> create-netrc.sh
---> logs-deploy.sh
+ ARCHIVE_ARTIFACTS=
+ LOGS_SERVER=https://logs.edgexfoundry.org
+ '[' https://logs.edgexfoundry.org '==' None ]
+ NEXUS_URL=https://nexus.edgexfoundry.org
+ NEXUS_PATH=production/vex-yul-edgex-jenkins-1/device-grove-c-snap-fuji-stage-snap/102
+ BUILD_URL=https://jenkins.edgexfoundry.org/job/device-grove-c-snap-fuji-stage-snap/102/
+ lftools deploy archives -p https://nexus.edgexfoundry.org production/vex-yul-edgex-jenkins-1/device-grove-c-snap-fuji-stage-snap/102 <https://jenkins.edgexfoundry.org/job/device-grove-c-snap-fuji-stage-snap/ws/>
Archives upload complete.
+ lftools deploy logs https://nexus.edgexfoundry.org production/vex-yul-edgex-jenkins-1/device-grove-c-snap-fuji-stage-snap/102 https://jenkins.edgexfoundry.org/job/device-grove-c-snap-fuji-stage-snap/102/
---> uname -a:
Linux 7b5078ee0ae7 3.10.0-862.14.4.el7.x86_64 #1 SMP Wed Sep 26 15:12:11 UTC 2018 x86_64 Linux


---> lscpu:
Architecture: x86_64
CPU op-mode(s): 32-bit, 64-bit
Byte Order: Little Endian
Address sizes: 40 bits physical, 48 bits virtual
CPU(s): 4
On-line CPU(s) list: 0-3
Thread(s) per core: 1
Core(s) per socket: 1
Socket(s): 4
NUMA node(s): 1
Vendor ID: GenuineIntel
CPU family: 6
Model: 44
Model name: Westmere E56xx/L56xx/X56xx (IBRS update)
Stepping: 1
CPU MHz: 2933.396
BogoMIPS: 5866.79
Virtualization: VT-x
Hypervisor vendor: KVM
Virtualization type: full
L1d cache: 128 KiB
L1i cache: 128 KiB
L2 cache: 16 MiB
L3 cache: 64 MiB
NUMA node0 CPU(s): 0-3
Vulnerability L1tf: Mitigation; PTE Inversion; VMX SMT disabled, L1D conditional cache flushes
Vulnerability Meltdown: Mitigation; PTI
Vulnerability Spec store bypass: Mitigation; Speculative Store Bypass disabled via prctl and seccomp
Vulnerability Spectre v1: Mitigation; Load fences, __user pointer sanitization
Vulnerability Spectre v2: Mitigation; Full retpoline
Flags: fpu vme de pse tsc msr pae mce cx8 apic sep mtrr pge mca cmov pat pse36 clflush mmx fxsr sse sse2 ss syscall nx pdpe1gb rdtscp lm constant_tsc rep_good nopl xtopology eagerfpu pni pclmulqdq vmx ssse3 cx16 pcid sse4_1 sse4_2 x2apic popcnt tsc_deadline_timer aes hypervisor lahf_lm ssbd ibrs ibpb stibp tpr_shadow vnmi flexpriority ept vpid tsc_adjust arat spec_ctrl intel_stibp


---> nproc:
4


---> df -h:
Filesystem Size Used Available Use% Mounted on
overlay 50.0G 7.1G 42.9G 14% /
tmpfs 64.0M 0 64.0M 0% /dev
tmpfs 919.1M 0 919.1M 0% /sys/fs/cgroup
/dev/vda1 50.0G 7.1G 42.9G 14% /home/jenkins
shm 64.0M 0 64.0M 0% /dev/shm
/dev/vda1 50.0G 7.1G 42.9G 14% /etc/resolv.conf
/dev/vda1 50.0G 7.1G 42.9G 14% /etc/hostname
/dev/vda1 50.0G 7.1G 42.9G 14% /etc/hosts
/dev/vda1 50.0G 7.1G 42.9G 14% /var/log/sa
/dev/vda1 50.0G 7.1G 42.9G 14% <https://jenkins.edgexfoundry.org/job/device-grove-c-snap-fuji-stage-snap/ws/@tmp>
/dev/vda1 50.0G 7.1G 42.9G 14% <https://jenkins.edgexfoundry.org/job/device-grove-c-snap-fuji-stage-snap/ws/>


---> free -m:
total used free shared buff/cache available
Mem: 1838 696 118 0 1023 1058
Swap: 1023 2 1021


---> ip addr:
1: lo: <LOOPBACK,UP,LOWER_UP> mtu 65536 qdisc noqueue state UNKNOWN qlen 1000
link/loopback 00:00:00:00:00:00 brd 00:00:00:00:00:00
inet 127.0.0.1/8 scope host lo
valid_lft forever preferred_lft forever
10: eth0@if11: <BROADCAST,MULTICAST,UP,LOWER_UP,M-DOWN> mtu 1458 qdisc noqueue state UP
link/ether 02:42:0a:fa:00:01 brd ff:ff:ff:ff:ff:ff
inet 10.250.0.1/24 brd 10.250.0.255 scope global eth0
valid_lft forever preferred_lft forever


---> sar -b -r -n DEV:
Linux 3.10.0-862.14.4.el7.x86_64 (centos-7-docker-5bc7e375-1660-33dc-fe50-cb0f4dbfa1d5.vexxhost.ne) 02/24/20 _x86_64_ (4 CPU)

03:59:27 LINUX RESTART

04:00:01 tps rtps wtps bread/s bwrtn/s
04:01:02 198.99 12.30 186.70 2262.18 34458.29
04:02:01 589.82 429.63 160.19 23143.57 26199.70
04:03:01 302.25 106.82 195.42 5453.40 26387.80
04:04:01 84.10 29.29 54.81 2099.23 3915.15
04:05:02 117.70 55.80 61.89 4192.71 15435.92
Average: 257.57 125.73 131.84 7377.76 21292.75

04:00:01 kbmemfree kbmemused %memused kbbuffers kbcached kbcommit %commit kbactive kbinact kbdirty
04:01:02 70532 1811772 96.25 2544 1001256 1350060 46.06 500484 1034868 109788
04:02:01 79396 1802908 95.78 2196 1090776 1096496 37.41 522884 989064 74228
04:03:01 77040 1805264 95.91 1584 997200 1162192 39.65 630648 914500 31536
04:04:01 246152 1636152 86.92 1492 922632 1073460 36.63 512704 851292 12868
04:05:02 163128 1719176 91.33 1488 1028388 1119544 38.20 504652 953836 85192
Average: 127250 1755054 93.24 1861 1008050 1160350 39.59 534274 948712 62722

04:00:01 IFACE rxpck/s txpck/s rxkB/s txkB/s rxcmp/s txcmp/s rxmcst/s
04:01:02 vethed4d837 315.61 354.04 23.47 3875.89 0.00 0.00 0.00
04:01:02 eth0 736.15 561.16 4884.65 84.27 0.00 0.00 0.00
04:01:02 lo 0.10 0.10 0.01 0.01 0.00 0.00 0.00
04:01:02 docker0 315.61 353.91 19.15 3875.88 0.00 0.00 0.00
04:02:01 eth0 0.76 0.74 0.16 0.18 0.00 0.00 0.00
04:02:01 lo 0.00 0.00 0.00 0.00 0.00 0.00 0.00
04:02:01 docker0 0.00 0.00 0.00 0.00 0.00 0.00 0.00
04:03:01 eth0 212.37 141.25 2001.17 12.53 0.00 0.00 0.00
04:03:01 lo 0.00 0.00 0.00 0.00 0.00 0.00 0.00
04:03:01 vethff919b4 128.99 198.10 9.36 1998.21 0.00 0.00 0.00
04:03:01 docker0 447.65 555.29 26.94 5911.49 0.00 0.00 0.00
04:04:01 eth0 53.71 47.10 106.73 7.42 0.00 0.00 0.00
04:04:01 lo 0.00 0.00 0.00 0.00 0.00 0.00 0.00
04:04:01 vethff919b4 23.24 26.59 2.01 96.85 0.00 0.00 0.00
04:04:01 docker0 23.24 26.59 1.69 96.85 0.00 0.00 0.00
04:05:02 eth0 233.21 204.89 2658.62 26.13 0.00 0.00 0.00
04:05:02 lo 0.00 0.00 0.00 0.00 0.00 0.00 0.00
04:05:02 docker0 106.89 112.19 5.84 513.36 0.00 0.00 0.00
Average: eth0 188.75 153.74 1830.45 17.62 0.00 0.00 0.00
Average: lo 0.00 0.00 0.00 0.00 0.00 0.00 0.00
Average: docker0 115.66 138.93 6.90 1305.49 0.00 0.00 0.00


---> sar -P ALL:
Linux 3.10.0-862.14.4.el7.x86_64 (centos-7-docker-5bc7e375-1660-33dc-fe50-cb0f4dbfa1d5.vexxhost.ne) 02/24/20 _x86_64_ (4 CPU)

03:59:27 LINUX RESTART

04:00:01 CPU %user %nice %system %iowait %steal %idle
04:01:02 all 14.26 0.00 5.96 2.06 0.01 77.71
04:01:02 0 13.75 0.00 6.62 1.25 0.02 78.36
04:01:02 1 14.51 0.00 5.90 2.34 0.02 77.23
04:01:02 2 16.81 0.00 6.16 1.65 0.02 75.37
04:01:02 3 11.95 0.00 5.18 3.00 0.02 79.85
04:02:01 all 6.60 0.00 6.29 16.98 0.04 70.08
04:02:01 0 7.10 0.00 6.16 18.33 0.05 68.36
04:02:01 1 7.97 0.00 6.33 17.87 0.05 67.78
04:02:01 2 5.28 0.00 6.63 15.56 0.03 72.50
04:02:01 3 6.06 0.00 6.01 16.20 0.03 71.69
04:03:01 all 8.05 0.00 5.75 3.77 0.01 82.42
04:03:01 0 7.68 0.00 6.62 2.81 0.02 82.88
04:03:01 1 7.98 0.00 5.14 3.34 0.02 83.52
04:03:01 2 5.28 0.00 5.45 3.18 0.03 86.05
04:03:01 3 11.26 0.00 5.79 5.75 0.02 77.19
04:04:01 all 22.48 0.00 6.65 0.88 0.01 69.98
04:04:01 0 18.25 0.00 6.51 0.08 0.02 75.14
04:04:01 1 34.95 0.00 7.79 0.64 0.00 56.62
04:04:01 2 20.44 0.00 6.00 1.83 0.00 71.74
04:04:01 3 16.28 0.00 6.26 1.01 0.00 76.45
04:05:02 all 10.46 0.00 4.78 1.70 0.01 83.04
04:05:02 0 9.26 0.00 5.42 0.15 0.00 85.17
04:05:02 1 18.35 0.00 4.71 2.44 0.03 74.46
04:05:02 2 6.24 0.00 5.15 1.06 0.00 87.56
04:05:02 3 8.01 0.00 3.88 3.11 0.02 84.99
Average: all 12.41 0.00 5.89 5.01 0.02 76.67
Average: 0 11.24 0.00 6.27 4.46 0.02 78.01
Average: 1 16.80 0.00 5.97 5.26 0.02 71.95
Average: 2 10.85 0.00 5.87 4.59 0.02 78.66
Average: 3 10.74 0.00 5.42 5.74 0.02 78.08


-----END_OF_BUILD-----
Logs upload complete.
Build logs: <a href="https://logs.edgexfoundry.org/production/vex-yul-edgex-jenkins-1/device-grove-c-snap-fuji-stage-snap/102">https://logs.edgexfoundry.org/production/vex-yul-edgex-jenkins-1/device-grove-c-snap-fuji-stage-snap/102</a>
+ set +x
[description-setter] Description set: Build logs: <a href="https://logs.edgexfoundry.org/production/vex-yul-edgex-jenkins-1/device-grove-c-snap-fuji-stage-snap/102">https://logs.edgexfoundry.org/production/vex-yul-edgex-jenkins-1/device-grove-c-snap-fuji-stage-snap/102</a>

Jenkins build is back to normal : edgex-ui-go-snap-fuji-stage-snap #103 #jenkins

Jenkins <jenkins-donotreply@...>
 

Build failed in Jenkins: edgex-ui-go-snap-master-stage-snap #258 #jenkins

Jenkins <jenkins-donotreply@...>
 

See <https://jenkins.edgexfoundry.org/job/edgex-ui-go-snap-master-stage-snap/258/display/redirect>

Changes:


------------------------------------------
[...truncated 69.39 KB...]
[edgex-ui-go-snap] $ /bin/bash /tmp/jenkins5017170283230170524.sh
---> package-listing.sh
++ facter osfamily
++ tr '[:upper:]' '[:lower:]'
+ OS_FAMILY=redhat
+ workspace=<https://jenkins.edgexfoundry.org/job/edgex-ui-go-snap-master-stage-snap/ws/>
+ START_PACKAGES=/tmp/packages_start.txt
+ END_PACKAGES=/tmp/packages_end.txt
+ DIFF_PACKAGES=/tmp/packages_diff.txt
+ PACKAGES=/tmp/packages_start.txt
+ '[' <https://jenkins.edgexfoundry.org/job/edgex-ui-go-snap-master-stage-snap/ws/> ']'
+ PACKAGES=/tmp/packages_end.txt
+ case "${OS_FAMILY}" in
+ rpm -qa
+ sort
+ '[' -f /tmp/packages_start.txt ']'
+ '[' -f /tmp/packages_end.txt ']'
+ diff /tmp/packages_start.txt /tmp/packages_end.txt
+ '[' <https://jenkins.edgexfoundry.org/job/edgex-ui-go-snap-master-stage-snap/ws/> ']'
+ mkdir -p <https://jenkins.edgexfoundry.org/job/edgex-ui-go-snap-master-stage-snap/ws/archives/>
+ cp -f /tmp/packages_diff.txt /tmp/packages_end.txt /tmp/packages_start.txt <https://jenkins.edgexfoundry.org/job/edgex-ui-go-snap-master-stage-snap/ws/archives/>
provisioning config files...
copy managed file [jenkins-log-archives-settings] to file:<https://jenkins.edgexfoundry.org/job/edgex-ui-go-snap-master-stage-snap/ws/@tmp/config8224527688153768665tmp>
[edgex-ui-go-snap] $ /bin/bash /tmp/jenkins1218736654754592216.sh
---> edgex-infra-ship-logs.sh
Unable to find image 'nexus3.edgexfoundry.org:10003/edgex-lftools-log-publisher:x86_64' locally
x86_64: Pulling from edgex-lftools-log-publisher
e6b0cf9c0882: Pulling fs layer
da0e9bf0cc60: Pulling fs layer
c9ea274ed700: Pulling fs layer
9cfac6ba3733: Pulling fs layer
f6a933c9cadc: Pulling fs layer
61811dbd4963: Pulling fs layer
a6eb2c9e2280: Pulling fs layer
095dd8b7b4d8: Pulling fs layer
dc21a1d4508b: Pulling fs layer
363af2e989c4: Pulling fs layer
9cfac6ba3733: Waiting
f6a933c9cadc: Waiting
61811dbd4963: Waiting
a6eb2c9e2280: Waiting
095dd8b7b4d8: Waiting
dc21a1d4508b: Waiting
363af2e989c4: Waiting
da0e9bf0cc60: Verifying Checksum
da0e9bf0cc60: Download complete
9cfac6ba3733: Verifying Checksum
9cfac6ba3733: Download complete
e6b0cf9c0882: Verifying Checksum
e6b0cf9c0882: Download complete
f6a933c9cadc: Verifying Checksum
f6a933c9cadc: Download complete
a6eb2c9e2280: Verifying Checksum
a6eb2c9e2280: Download complete
e6b0cf9c0882: Pull complete
da0e9bf0cc60: Pull complete
c9ea274ed700: Verifying Checksum
c9ea274ed700: Download complete
dc21a1d4508b: Verifying Checksum
dc21a1d4508b: Download complete
363af2e989c4: Verifying Checksum
363af2e989c4: Download complete
095dd8b7b4d8: Verifying Checksum
095dd8b7b4d8: Download complete
61811dbd4963: Verifying Checksum
61811dbd4963: Download complete
c9ea274ed700: Pull complete
9cfac6ba3733: Pull complete
f6a933c9cadc: Pull complete
61811dbd4963: Pull complete
a6eb2c9e2280: Pull complete
095dd8b7b4d8: Pull complete
dc21a1d4508b: Pull complete
363af2e989c4: Pull complete
Digest: sha256:add8188b58b49eaf945790de1a8bc2588125c85e750a42d0a8acc29426f6ed5f
Status: Downloaded newer image for nexus3.edgexfoundry.org:10003/edgex-lftools-log-publisher:x86_64
---> create-netrc.sh
---> logs-deploy.sh
+ ARCHIVE_ARTIFACTS=
+ LOGS_SERVER=https://logs.edgexfoundry.org
+ '[' https://logs.edgexfoundry.org '==' None ]
+ NEXUS_URL=https://nexus.edgexfoundry.org
+ NEXUS_PATH=production/vex-yul-edgex-jenkins-1/edgex-ui-go-snap-master-stage-snap/258
+ BUILD_URL=https://jenkins.edgexfoundry.org/job/edgex-ui-go-snap-master-stage-snap/258/
+ lftools deploy archives -p https://nexus.edgexfoundry.org production/vex-yul-edgex-jenkins-1/edgex-ui-go-snap-master-stage-snap/258 <https://jenkins.edgexfoundry.org/job/edgex-ui-go-snap-master-stage-snap/ws/>
Archives upload complete.
+ lftools deploy logs https://nexus.edgexfoundry.org production/vex-yul-edgex-jenkins-1/edgex-ui-go-snap-master-stage-snap/258 https://jenkins.edgexfoundry.org/job/edgex-ui-go-snap-master-stage-snap/258/
---> uname -a:
Linux 1956fdfb287a 3.10.0-862.14.4.el7.x86_64 #1 SMP Wed Sep 26 15:12:11 UTC 2018 x86_64 Linux


---> lscpu:
Architecture: x86_64
CPU op-mode(s): 32-bit, 64-bit
Byte Order: Little Endian
Address sizes: 40 bits physical, 48 bits virtual
CPU(s): 4
On-line CPU(s) list: 0-3
Thread(s) per core: 1
Core(s) per socket: 1
Socket(s): 4
NUMA node(s): 1
Vendor ID: GenuineIntel
CPU family: 6
Model: 44
Model name: Westmere E56xx/L56xx/X56xx (IBRS update)
Stepping: 1
CPU MHz: 2933.438
BogoMIPS: 5866.87
Virtualization: VT-x
Hypervisor vendor: KVM
Virtualization type: full
L1d cache: 128 KiB
L1i cache: 128 KiB
L2 cache: 16 MiB
L3 cache: 64 MiB
NUMA node0 CPU(s): 0-3
Vulnerability L1tf: Mitigation; PTE Inversion; VMX SMT disabled, L1D conditional cache flushes
Vulnerability Meltdown: Mitigation; PTI
Vulnerability Spec store bypass: Mitigation; Speculative Store Bypass disabled via prctl and seccomp
Vulnerability Spectre v1: Mitigation; Load fences, __user pointer sanitization
Vulnerability Spectre v2: Mitigation; Full retpoline
Flags: fpu vme de pse tsc msr pae mce cx8 apic sep mtrr pge mca cmov pat pse36 clflush mmx fxsr sse sse2 ss syscall nx pdpe1gb rdtscp lm constant_tsc rep_good nopl xtopology eagerfpu pni pclmulqdq vmx ssse3 cx16 pcid sse4_1 sse4_2 x2apic popcnt tsc_deadline_timer aes hypervisor lahf_lm ssbd ibrs ibpb stibp tpr_shadow vnmi flexpriority ept vpid tsc_adjust arat spec_ctrl intel_stibp


---> nproc:
4


---> df -h:
Filesystem Size Used Available Use% Mounted on
overlay 50.0G 7.1G 42.9G 14% /
tmpfs 64.0M 0 64.0M 0% /dev
tmpfs 919.1M 0 919.1M 0% /sys/fs/cgroup
/dev/vda1 50.0G 7.1G 42.9G 14% /home/jenkins
shm 64.0M 0 64.0M 0% /dev/shm
/dev/vda1 50.0G 7.1G 42.9G 14% /etc/resolv.conf
/dev/vda1 50.0G 7.1G 42.9G 14% /etc/hostname
/dev/vda1 50.0G 7.1G 42.9G 14% /etc/hosts
/dev/vda1 50.0G 7.1G 42.9G 14% /var/log/sa
/dev/vda1 50.0G 7.1G 42.9G 14% <https://jenkins.edgexfoundry.org/job/edgex-ui-go-snap-master-stage-snap/ws/@tmp>
/dev/vda1 50.0G 7.1G 42.9G 14% <https://jenkins.edgexfoundry.org/job/edgex-ui-go-snap-master-stage-snap/ws/>


---> free -m:
total used free shared buff/cache available
Mem: 1838 669 228 0 940 1078
Swap: 1023 2 1021


---> ip addr:
1: lo: <LOOPBACK,UP,LOWER_UP> mtu 65536 qdisc noqueue state UNKNOWN qlen 1000
link/loopback 00:00:00:00:00:00 brd 00:00:00:00:00:00
inet 127.0.0.1/8 scope host lo
valid_lft forever preferred_lft forever
10: eth0@if11: <BROADCAST,MULTICAST,UP,LOWER_UP,M-DOWN> mtu 1458 qdisc noqueue state UP
link/ether 02:42:0a:fa:00:01 brd ff:ff:ff:ff:ff:ff
inet 10.250.0.1/24 brd 10.250.0.255 scope global eth0
valid_lft forever preferred_lft forever


---> sar -b -r -n DEV:
Linux 3.10.0-862.14.4.el7.x86_64 (centos-7-docker-5bc7e375-1660-33dc-fe50-cb0f4dbfa1d5.vexxhost.ne) 02/23/20 _x86_64_ (4 CPU)

22:52:39 LINUX RESTART

22:53:02 tps rtps wtps bread/s bwrtn/s
22:54:01 157.13 43.93 113.20 5167.59 42230.87
22:55:01 347.11 173.64 173.46 11915.80 43555.90
22:56:01 474.32 318.52 155.80 14892.46 22367.83
22:57:01 159.50 8.90 150.60 502.40 22715.41
22:58:01 138.65 92.33 46.32 6071.25 6994.94
Average: 255.64 127.73 127.92 7718.34 27528.56

22:53:02 kbmemfree kbmemused %memused kbbuffers kbcached kbcommit %commit kbactive kbinact kbdirty
22:54:01 78088 1804216 95.85 2620 1199152 1113736 38.00 486480 1151488 10108
22:55:01 78628 1803676 95.82 2544 1152876 1085952 37.05 391848 1152920 27548
22:56:01 425928 1456376 77.37 2072 738840 1131324 38.60 490856 728996 8020
22:57:01 77212 1805092 95.90 1548 1072116 1087344 37.10 680752 844292 98400
22:58:01 596732 1285572 68.30 1172 636284 1087412 37.10 446824 602616 69416
Average: 251318 1630986 86.65 1991 959854 1101154 37.57 499352 896062 42698

22:53:02 IFACE rxpck/s txpck/s rxkB/s txkB/s rxcmp/s txcmp/s rxmcst/s
22:54:01 veth3574593 43.78 51.54 3.16 388.90 0.00 0.00 0.00
22:54:01 eth0 301.17 206.12 1470.06 59.25 0.00 0.00 0.00
22:54:01 lo 0.10 0.10 0.01 0.01 0.00 0.00 0.00
22:54:01 docker0 43.78 51.40 2.56 388.89 0.00 0.00 0.00
22:55:01 eth0 266.89 173.74 3524.64 12.53 0.00 0.00 0.00
22:55:01 lo 0.00 0.00 0.00 0.00 0.00 0.00 0.00
22:55:01 docker0 171.90 264.25 9.76 3524.20 0.00 0.00 0.00
22:56:01 veth04a641e 0.00 0.12 0.00 0.01 0.00 0.00 0.00
22:56:01 eth0 564.64 377.98 4975.64 71.11 0.00 0.00 0.00
22:56:01 lo 0.10 0.10 0.01 0.01 0.00 0.00 0.00
22:56:01 docker0 215.16 315.09 12.28 3910.12 0.00 0.00 0.00
22:57:01 veth04a641e 172.87 242.29 12.56 2895.45 0.00 0.00 0.00
22:57:01 eth0 258.12 185.64 2898.53 15.81 0.00 0.00 0.00
22:57:01 lo 0.00 0.00 0.00 0.00 0.00 0.00 0.00
22:57:01 docker0 172.87 242.28 10.20 2895.45 0.00 0.00 0.00
22:58:01 eth0 135.26 106.27 1847.00 19.89 0.00 0.00 0.00
22:58:01 lo 0.00 0.00 0.00 0.00 0.00 0.00 0.00
22:58:01 docker0 57.46 79.24 3.70 725.74 0.00 0.00 0.00
Average: eth0 186.21 131.73 1941.99 21.17 0.00 0.00 0.00
Average: lo 0.00 0.00 0.00 0.00 0.00 0.00 0.00
Average: docker0 89.35 127.68 5.25 1510.44 0.00 0.00 0.00


---> sar -P ALL:
Linux 3.10.0-862.14.4.el7.x86_64 (centos-7-docker-5bc7e375-1660-33dc-fe50-cb0f4dbfa1d5.vexxhost.ne) 02/23/20 _x86_64_ (4 CPU)

22:52:39 LINUX RESTART

22:53:02 CPU %user %nice %system %iowait %steal %idle
22:54:01 all 15.36 0.00 8.09 4.54 14.53 57.48
22:54:01 0 11.87 0.00 10.53 1.75 15.08 60.78
22:54:01 1 18.61 0.00 7.07 6.74 15.43 52.15
22:54:01 2 14.80 0.00 6.50 5.00 13.96 59.75
22:54:01 3 16.16 0.00 8.28 4.71 13.65 57.21
22:55:01 all 11.10 0.00 5.52 6.66 8.17 68.55
22:55:01 0 8.69 0.00 4.93 6.18 8.78 71.43
22:55:01 1 12.78 0.00 5.74 6.21 8.54 66.74
22:55:01 2 14.32 0.00 6.56 6.66 7.44 65.02
22:55:01 3 8.60 0.00 4.85 7.63 7.91 71.01
22:56:01 all 5.19 0.00 4.99 11.05 9.14 69.64
22:56:01 0 9.36 0.00 5.09 9.53 9.49 66.53
22:56:01 1 4.83 0.00 5.50 11.90 9.29 68.48
22:56:01 2 3.33 0.00 4.59 10.49 8.94 72.65
22:56:01 3 3.22 0.00 4.78 12.27 8.83 70.91
22:57:01 all 8.77 0.00 3.91 0.57 5.65 81.10
22:57:01 0 5.45 0.00 3.44 0.97 6.29 83.84
22:57:01 1 4.29 0.00 3.66 0.25 5.28 86.52
22:57:01 2 13.50 0.00 4.46 0.62 5.99 75.43
22:57:01 3 12.00 0.00 4.12 0.42 5.04 78.42
22:58:01 all 20.03 0.00 5.46 2.17 6.79 65.54
22:58:01 0 26.46 0.00 5.89 4.26 8.41 54.98
22:58:01 1 19.03 0.00 5.31 2.28 5.75 67.63
22:58:01 2 17.97 0.00 5.04 1.12 7.19 68.68
22:58:01 3 16.72 0.00 5.60 1.05 5.84 70.79
Average: all 12.04 0.00 5.59 5.01 8.86 68.50
Average: 0 12.28 0.00 5.97 4.53 9.61 67.61
Average: 1 11.84 0.00 5.45 5.47 8.85 68.39
Average: 2 12.71 0.00 5.42 4.80 8.72 68.35
Average: 3 11.32 0.00 5.52 5.23 8.25 69.68


-----END_OF_BUILD-----
Logs upload complete.
+ set +x
Build logs: <a href="https://logs.edgexfoundry.org/production/vex-yul-edgex-jenkins-1/edgex-ui-go-snap-master-stage-snap/258">https://logs.edgexfoundry.org/production/vex-yul-edgex-jenkins-1/edgex-ui-go-snap-master-stage-snap/258</a>
[description-setter] Description set: Build logs: <a href="https://logs.edgexfoundry.org/production/vex-yul-edgex-jenkins-1/edgex-ui-go-snap-master-stage-snap/258">https://logs.edgexfoundry.org/production/vex-yul-edgex-jenkins-1/edgex-ui-go-snap-master-stage-snap/258</a>

Build failed in Jenkins: device-modbus-go-snap-master-stage-snap #282 #jenkins

Jenkins <jenkins-donotreply@...>
 

See <https://jenkins.edgexfoundry.org/job/device-modbus-go-snap-master-stage-snap/282/display/redirect>

Changes:


------------------------------------------
[...truncated 46.24 KB...]
Skipping stage go (already ran)
Staging device-modbus
Priming go
Priming device-modbus
DEPRECATED: The 'version-script' keyword has been deprecated in favour of the 'snapcraftctl set-version' part scriptlet.
See http://snapcraft.io/docs/deprecation-notices/dn10 for more information.
Determining the version from the project repo (version-script).
cat: VERSION: No such file or directory
The version has been set to '-20200223+f8002f6'
error: cannot validate snap "edgex-device-modbus": invalid snap version "-20200223+f8002f6": must start with an ASCII alphanumeric (and not '-')
Failed to verify directory to pack.
Build step 'Execute shell' marked build as failure
$ ssh-agent -k
unset SSH_AUTH_SOCK;
unset SSH_AGENT_PID;
echo Agent pid 9766 killed;
[ssh-agent] Stopped.
[PostBuildScript] - [INFO] Executing post build scripts.
[device-modbus-go-snap] $ /bin/bash /tmp/jenkins193751794806062186.sh
---> sysstat.sh
[device-modbus-go-snap] $ /bin/bash /tmp/jenkins3014644630329127353.sh
---> package-listing.sh
++ facter osfamily
++ tr '[:upper:]' '[:lower:]'
+ OS_FAMILY=redhat
+ workspace=<https://jenkins.edgexfoundry.org/job/device-modbus-go-snap-master-stage-snap/ws/>
+ START_PACKAGES=/tmp/packages_start.txt
+ END_PACKAGES=/tmp/packages_end.txt
+ DIFF_PACKAGES=/tmp/packages_diff.txt
+ PACKAGES=/tmp/packages_start.txt
+ '[' <https://jenkins.edgexfoundry.org/job/device-modbus-go-snap-master-stage-snap/ws/> ']'
+ PACKAGES=/tmp/packages_end.txt
+ case "${OS_FAMILY}" in
+ rpm -qa
+ sort
+ '[' -f /tmp/packages_start.txt ']'
+ '[' -f /tmp/packages_end.txt ']'
+ diff /tmp/packages_start.txt /tmp/packages_end.txt
+ '[' <https://jenkins.edgexfoundry.org/job/device-modbus-go-snap-master-stage-snap/ws/> ']'
+ mkdir -p <https://jenkins.edgexfoundry.org/job/device-modbus-go-snap-master-stage-snap/ws/archives/>
+ cp -f /tmp/packages_diff.txt /tmp/packages_end.txt /tmp/packages_start.txt <https://jenkins.edgexfoundry.org/job/device-modbus-go-snap-master-stage-snap/ws/archives/>
provisioning config files...
copy managed file [jenkins-log-archives-settings] to file:<https://jenkins.edgexfoundry.org/job/device-modbus-go-snap-master-stage-snap/ws/@tmp/config464046911993629866tmp>
[device-modbus-go-snap] $ /bin/bash /tmp/jenkins3735825247715977400.sh
---> edgex-infra-ship-logs.sh
Unable to find image 'nexus3.edgexfoundry.org:10003/edgex-lftools-log-publisher:x86_64' locally
x86_64: Pulling from edgex-lftools-log-publisher
e6b0cf9c0882: Pulling fs layer
da0e9bf0cc60: Pulling fs layer
c9ea274ed700: Pulling fs layer
9cfac6ba3733: Pulling fs layer
f6a933c9cadc: Pulling fs layer
61811dbd4963: Pulling fs layer
a6eb2c9e2280: Pulling fs layer
095dd8b7b4d8: Pulling fs layer
dc21a1d4508b: Pulling fs layer
363af2e989c4: Pulling fs layer
61811dbd4963: Waiting
a6eb2c9e2280: Waiting
095dd8b7b4d8: Waiting
dc21a1d4508b: Waiting
363af2e989c4: Waiting
9cfac6ba3733: Waiting
f6a933c9cadc: Waiting
da0e9bf0cc60: Verifying Checksum
da0e9bf0cc60: Download complete
9cfac6ba3733: Verifying Checksum
9cfac6ba3733: Download complete
e6b0cf9c0882: Verifying Checksum
e6b0cf9c0882: Download complete
f6a933c9cadc: Verifying Checksum
f6a933c9cadc: Download complete
a6eb2c9e2280: Verifying Checksum
a6eb2c9e2280: Download complete
c9ea274ed700: Verifying Checksum
c9ea274ed700: Download complete
095dd8b7b4d8: Verifying Checksum
095dd8b7b4d8: Download complete
363af2e989c4: Verifying Checksum
363af2e989c4: Download complete
dc21a1d4508b: Verifying Checksum
dc21a1d4508b: Download complete
e6b0cf9c0882: Pull complete
da0e9bf0cc60: Pull complete
61811dbd4963: Verifying Checksum
61811dbd4963: Download complete
c9ea274ed700: Pull complete
9cfac6ba3733: Pull complete
f6a933c9cadc: Pull complete
61811dbd4963: Pull complete
a6eb2c9e2280: Pull complete
095dd8b7b4d8: Pull complete
dc21a1d4508b: Pull complete
363af2e989c4: Pull complete
Digest: sha256:add8188b58b49eaf945790de1a8bc2588125c85e750a42d0a8acc29426f6ed5f
Status: Downloaded newer image for nexus3.edgexfoundry.org:10003/edgex-lftools-log-publisher:x86_64
---> create-netrc.sh
+ ARCHIVE_ARTIFACTS=
+ LOGS_SERVER=https://logs.edgexfoundry.org
---> logs-deploy.sh
+ '[' https://logs.edgexfoundry.org '==' None ]
+ NEXUS_URL=https://nexus.edgexfoundry.org
+ NEXUS_PATH=production/vex-yul-edgex-jenkins-1/device-modbus-go-snap-master-stage-snap/282
+ BUILD_URL=https://jenkins.edgexfoundry.org/job/device-modbus-go-snap-master-stage-snap/282/
+ lftools deploy archives -p https://nexus.edgexfoundry.org production/vex-yul-edgex-jenkins-1/device-modbus-go-snap-master-stage-snap/282 <https://jenkins.edgexfoundry.org/job/device-modbus-go-snap-master-stage-snap/ws/>
Archives upload complete.
+ lftools deploy logs https://nexus.edgexfoundry.org production/vex-yul-edgex-jenkins-1/device-modbus-go-snap-master-stage-snap/282 https://jenkins.edgexfoundry.org/job/device-modbus-go-snap-master-stage-snap/282/
---> uname -a:
Linux 9c7e08d3b097 3.10.0-862.14.4.el7.x86_64 #1 SMP Wed Sep 26 15:12:11 UTC 2018 x86_64 Linux


---> lscpu:
Architecture: x86_64
CPU op-mode(s): 32-bit, 64-bit
Byte Order: Little Endian
Address sizes: 40 bits physical, 48 bits virtual
CPU(s): 4
On-line CPU(s) list: 0-3
Thread(s) per core: 1
Core(s) per socket: 1
Socket(s): 4
NUMA node(s): 1
Vendor ID: GenuineIntel
CPU family: 6
Model: 44
Model name: Westmere E56xx/L56xx/X56xx (IBRS update)
Stepping: 1
CPU MHz: 2933.396
BogoMIPS: 5866.79
Virtualization: VT-x
Hypervisor vendor: KVM
Virtualization type: full
L1d cache: 128 KiB
L1i cache: 128 KiB
L2 cache: 16 MiB
L3 cache: 64 MiB
NUMA node0 CPU(s): 0-3
Vulnerability L1tf: Mitigation; PTE Inversion; VMX SMT disabled, L1D conditional cache flushes
Vulnerability Meltdown: Mitigation; PTI
Vulnerability Spec store bypass: Mitigation; Speculative Store Bypass disabled via prctl and seccomp
Vulnerability Spectre v1: Mitigation; Load fences, __user pointer sanitization
Vulnerability Spectre v2: Mitigation; Full retpoline
Flags: fpu vme de pse tsc msr pae mce cx8 apic sep mtrr pge mca cmov pat pse36 clflush mmx fxsr sse sse2 ss syscall nx pdpe1gb rdtscp lm constant_tsc rep_good nopl xtopology eagerfpu pni pclmulqdq vmx ssse3 cx16 pcid sse4_1 sse4_2 x2apic popcnt tsc_deadline_timer aes hypervisor lahf_lm ssbd ibrs ibpb stibp tpr_shadow vnmi flexpriority ept vpid tsc_adjust arat spec_ctrl intel_stibp


---> nproc:
4


---> df -h:
Filesystem Size Used Available Use% Mounted on
overlay 50.0G 7.1G 42.9G 14% /
tmpfs 64.0M 0 64.0M 0% /dev
tmpfs 919.1M 0 919.1M 0% /sys/fs/cgroup
/dev/vda1 50.0G 7.1G 42.9G 14% /home/jenkins
shm 64.0M 0 64.0M 0% /dev/shm
/dev/vda1 50.0G 7.1G 42.9G 14% /etc/resolv.conf
/dev/vda1 50.0G 7.1G 42.9G 14% /etc/hostname
/dev/vda1 50.0G 7.1G 42.9G 14% /etc/hosts
/dev/vda1 50.0G 7.1G 42.9G 14% /var/log/sa
/dev/vda1 50.0G 7.1G 42.9G 14% <https://jenkins.edgexfoundry.org/job/device-modbus-go-snap-master-stage-snap/ws/@tmp>
/dev/vda1 50.0G 7.1G 42.9G 14% <https://jenkins.edgexfoundry.org/job/device-modbus-go-snap-master-stage-snap/ws/>


---> free -m:
total used free shared buff/cache available
Mem: 1838 649 332 0 856 1097
Swap: 1023 4 1019


---> ip addr:
1: lo: <LOOPBACK,UP,LOWER_UP> mtu 65536 qdisc noqueue state UNKNOWN qlen 1000
link/loopback 00:00:00:00:00:00 brd 00:00:00:00:00:00
inet 127.0.0.1/8 scope host lo
valid_lft forever preferred_lft forever
10: eth0@if11: <BROADCAST,MULTICAST,UP,LOWER_UP,M-DOWN> mtu 1458 qdisc noqueue state UP
link/ether 02:42:0a:fa:00:01 brd ff:ff:ff:ff:ff:ff
inet 10.250.0.1/24 brd 10.250.0.255 scope global eth0
valid_lft forever preferred_lft forever


---> sar -b -r -n DEV:
Linux 3.10.0-862.14.4.el7.x86_64 (centos-7-docker-5bc7e375-1660-33dc-fe50-cb0f4dbfa1d5.vexxhost.ne) 02/23/20 _x86_64_ (4 CPU)

20:00:32 LINUX RESTART

20:01:01 tps rtps wtps bread/s bwrtn/s
20:02:01 200.69 16.71 183.97 2830.08 33665.41
20:03:01 590.25 413.24 177.01 22380.30 28377.41
20:04:02 230.85 89.26 141.60 4967.44 29093.80
Average: 340.46 173.04 167.42 10054.01 30369.91

20:01:01 kbmemfree kbmemused %memused kbbuffers kbcached kbcommit %commit kbactive kbinact kbdirty
20:02:01 87956 1794348 95.33 2620 1010976 1323832 45.17 498260 1020780 97172
20:03:01 72344 1809960 96.16 2456 1133288 1083016 36.95 503160 1024292 87648
20:04:02 76876 1805428 95.92 1880 1017800 1400112 47.77 735056 777540 88212
Average: 79059 1803245 95.80 2319 1054021 1268987 43.30 578825 940871 91011

20:01:01 IFACE rxpck/s txpck/s rxkB/s txkB/s rxcmp/s txcmp/s rxmcst/s
20:02:01 eth0 676.82 515.76 4899.09 80.81 0.00 0.00 0.00
20:02:01 lo 0.00 0.00 0.00 0.00 0.00 0.00 0.00
20:02:01 veth7ae59f1 304.93 348.60 23.32 3928.00 0.00 0.00 0.00
20:02:01 docker0 304.93 348.46 19.15 3927.99 0.00 0.00 0.00
20:03:01 eth0 0.73 0.85 0.15 0.18 0.00 0.00 0.00
20:03:01 lo 0.00 0.00 0.00 0.00 0.00 0.00 0.00
20:03:01 docker0 0.00 0.00 0.00 0.00 0.00 0.00 0.00
20:04:02 veth61626b3 385.99 454.48 30.27 3307.34 0.00 0.00 0.00
20:04:02 eth0 1160.37 926.43 8196.73 114.55 0.00 0.00 0.00
20:04:02 lo 0.10 0.10 0.01 0.01 0.00 0.00 0.00
20:04:02 docker0 686.70 797.99 43.87 7180.94 0.00 0.00 0.00
Average: veth61626b3 129.67 152.68 10.17 1111.05 0.00 0.00 0.00
Average: eth0 389.81 311.22 2753.57 38.48 0.00 0.00 0.00
Average: lo 0.03 0.03 0.00 0.00 0.00 0.00 0.00
Average: docker0 230.69 268.07 14.74 2412.33 0.00 0.00 0.00


---> sar -P ALL:
Linux 3.10.0-862.14.4.el7.x86_64 (centos-7-docker-5bc7e375-1660-33dc-fe50-cb0f4dbfa1d5.vexxhost.ne) 02/23/20 _x86_64_ (4 CPU)

20:00:32 LINUX RESTART

20:01:01 CPU %user %nice %system %iowait %steal %idle
20:02:01 all 20.10 0.00 7.50 2.15 0.01 70.23
20:02:01 0 17.57 0.00 9.29 0.36 0.00 72.79
20:02:01 1 22.36 0.00 6.68 0.62 0.02 70.32
20:02:01 2 18.66 0.00 6.99 2.63 0.02 71.69
20:02:01 3 21.80 0.00 7.05 4.98 0.02 66.15
20:03:01 all 6.38 0.00 6.13 14.20 0.03 73.26
20:03:01 0 7.16 0.00 6.79 12.98 0.03 73.05
20:03:01 1 4.84 0.00 5.78 14.84 0.05 74.49
20:03:01 2 6.02 0.00 5.86 14.42 0.02 73.68
20:03:01 3 7.52 0.00 6.10 14.58 0.02 71.78
20:04:02 all 16.26 0.00 8.87 2.13 0.01 72.73
20:04:02 0 14.76 0.00 9.09 1.17 0.00 74.98
20:04:02 1 18.82 0.00 8.45 3.05 0.02 69.66
20:04:02 2 18.78 0.00 8.93 1.15 0.02 71.13
20:04:02 3 12.67 0.00 9.01 3.15 0.02 75.15
Average: all 14.26 0.00 7.51 6.13 0.02 72.08
Average: 0 13.16 0.00 8.39 4.82 0.01 73.61
Average: 1 15.37 0.00 6.98 6.15 0.03 71.48
Average: 2 14.52 0.00 7.27 6.04 0.02 72.16
Average: 3 14.01 0.00 7.40 7.53 0.02 71.04


-----END_OF_BUILD-----
Logs upload complete.
Build logs: <a href="https://logs.edgexfoundry.org/production/vex-yul-edgex-jenkins-1/device-modbus-go-snap-master-stage-snap/282">https://logs.edgexfoundry.org/production/vex-yul-edgex-jenkins-1/device-modbus-go-snap-master-stage-snap/282</a>
+ set +x
[description-setter] Description set: Build logs: <a href="https://logs.edgexfoundry.org/production/vex-yul-edgex-jenkins-1/device-modbus-go-snap-master-stage-snap/282">https://logs.edgexfoundry.org/production/vex-yul-edgex-jenkins-1/device-modbus-go-snap-master-stage-snap/282</a>

Build failed in Jenkins: edgex-docs-fuji-stage-docs #114 #jenkins

Jenkins <jenkins-donotreply@...>
 

See <https://jenkins.edgexfoundry.org/job/edgex-docs-fuji-stage-docs/114/display/redirect>

Changes:


------------------------------------------
Started by timer
Running as SYSTEM
[EnvInject] - Loading node environment variables.
Building remotely on prd-centos7-docker-4c-2g-448 (centos7-docker-4c-2g) in workspace <https://jenkins.edgexfoundry.org/job/edgex-docs-fuji-stage-docs/ws/>
[ssh-agent] Looking for ssh-agent implementation...
[ssh-agent] Exec ssh-agent (binary ssh-agent on a remote machine)
$ ssh-agent
SSH_AUTH_SOCK=/tmp/ssh-xK7311Qto1dH/agent.9979
SSH_AGENT_PID=9982
[ssh-agent] Started.
Running ssh-add (command line suppressed)
Identity added: <https://jenkins.edgexfoundry.org/job/edgex-docs-fuji-stage-docs/ws/@tmp/private_key_1359166588732059047.key> (<https://jenkins.edgexfoundry.org/job/edgex-docs-fuji-stage-docs/ws/@tmp/private_key_1359166588732059047.key)>
[ssh-agent] Using credentials edgex-jenkins (SSH Credentials for GitHub)
using credential edgex-jenkins-ssh
Wiping out workspace first.
Cloning the remote Git repository
Cloning repository git@...:edgexfoundry/edgex-docs
> git init <https://jenkins.edgexfoundry.org/job/edgex-docs-fuji-stage-docs/ws/> # timeout=10
Fetching upstream changes from git@...:edgexfoundry/edgex-docs
> git --version # timeout=10
using GIT_SSH to set credentials SSH Credentials for GitHub
> git fetch --tags --progress -- git@...:edgexfoundry/edgex-docs +refs/heads/*:refs/remotes/origin/* # timeout=10
> git config remote.origin.url git@...:edgexfoundry/edgex-docs # timeout=10
> git config --add remote.origin.fetch +refs/heads/*:refs/remotes/origin/* # timeout=10
> git config remote.origin.url git@...:edgexfoundry/edgex-docs # timeout=10
Fetching upstream changes from git@...:edgexfoundry/edgex-docs
using GIT_SSH to set credentials SSH Credentials for GitHub
> git fetch --tags --progress -- git@...:edgexfoundry/edgex-docs +refs/heads/*:refs/remotes/origin/* # timeout=10
> git rev-parse refs/remotes/origin/fuji^{commit} # timeout=10
> git rev-parse refs/remotes/origin/refs/heads/fuji^{commit} # timeout=10
Checking out Revision 9d451bcefda6f263d699e52539cd22a40c70572e (refs/remotes/origin/fuji)
> git config core.sparsecheckout # timeout=10
> git checkout -f 9d451bcefda6f263d699e52539cd22a40c70572e # timeout=10
Commit message: "Merge pull request #76 from jpwhitemn/fuji"
> git rev-list --no-walk 9d451bcefda6f263d699e52539cd22a40c70572e # timeout=10
provisioning config files...
copy managed file [netrc] to file:/home/jenkins/.netrc
[edgex-docs] $ /bin/bash /tmp/jenkins6760202663972791625.sh
---> python-tools-install.sh
Generating Requirements File
Traceback (most recent call last):
File "/usr/lib64/python3.4/runpy.py", line 170, in _run_module_as_main
"__main__", mod_spec)
File "/usr/lib64/python3.4/runpy.py", line 85, in _run_code
exec(code, run_globals)
File "/home/jenkins/.local/lib/python3.4/site-packages/pip/__main__.py", line 16, in <module>
from pip._internal.cli.main import main as _main # isort:skip # noqa
File "/home/jenkins/.local/lib/python3.4/site-packages/pip/_internal/cli/main.py", line 10, in <module>
from pip._internal.cli.autocompletion import autocomplete
File "/home/jenkins/.local/lib/python3.4/site-packages/pip/_internal/cli/autocompletion.py", line 9, in <module>
from pip._internal.cli.main_parser import create_main_parser
File "/home/jenkins/.local/lib/python3.4/site-packages/pip/_internal/cli/main_parser.py", line 7, in <module>
from pip._internal.cli import cmdoptions
File "/home/jenkins/.local/lib/python3.4/site-packages/pip/_internal/cli/cmdoptions.py", line 28, in <module>
from pip._internal.models.target_python import TargetPython
File "/home/jenkins/.local/lib/python3.4/site-packages/pip/_internal/models/target_python.py", line 4, in <module>
from pip._internal.utils.misc import normalize_version_info
File "/home/jenkins/.local/lib/python3.4/site-packages/pip/_internal/utils/misc.py", line 20, in <module>
from pip._vendor import pkg_resources
File "/home/jenkins/.local/lib/python3.4/site-packages/pip/_vendor/pkg_resources/__init__.py", line 92, in <module>
raise RuntimeError("Python 3.5 or later is required")
RuntimeError: Python 3.5 or later is required
Build step 'Execute shell' marked build as failure
$ ssh-agent -k
unset SSH_AUTH_SOCK;
unset SSH_AGENT_PID;
echo Agent pid 9982 killed;
[ssh-agent] Stopped.
[PostBuildScript] - [INFO] Executing post build scripts.
[edgex-docs] $ /bin/bash /tmp/jenkins3308786129867312439.sh
---> sysstat.sh
[edgex-docs] $ /bin/bash /tmp/jenkins6988416604608800795.sh
---> package-listing.sh
++ facter osfamily
++ tr '[:upper:]' '[:lower:]'
+ OS_FAMILY=redhat
+ workspace=<https://jenkins.edgexfoundry.org/job/edgex-docs-fuji-stage-docs/ws/>
+ START_PACKAGES=/tmp/packages_start.txt
+ END_PACKAGES=/tmp/packages_end.txt
+ DIFF_PACKAGES=/tmp/packages_diff.txt
+ PACKAGES=/tmp/packages_start.txt
+ '[' <https://jenkins.edgexfoundry.org/job/edgex-docs-fuji-stage-docs/ws/> ']'
+ PACKAGES=/tmp/packages_end.txt
+ case "${OS_FAMILY}" in
+ rpm -qa
+ sort
+ '[' -f /tmp/packages_start.txt ']'
+ '[' -f /tmp/packages_end.txt ']'
+ diff /tmp/packages_start.txt /tmp/packages_end.txt
+ '[' <https://jenkins.edgexfoundry.org/job/edgex-docs-fuji-stage-docs/ws/> ']'
+ mkdir -p <https://jenkins.edgexfoundry.org/job/edgex-docs-fuji-stage-docs/ws/archives/>
+ cp -f /tmp/packages_diff.txt /tmp/packages_end.txt /tmp/packages_start.txt <https://jenkins.edgexfoundry.org/job/edgex-docs-fuji-stage-docs/ws/archives/>
provisioning config files...
copy managed file [jenkins-log-archives-settings] to file:<https://jenkins.edgexfoundry.org/job/edgex-docs-fuji-stage-docs/ws/@tmp/config6762768682608443736tmp>
[edgex-docs] $ /bin/bash /tmp/jenkins314845332046257289.sh
---> edgex-infra-ship-logs.sh
Unable to find image 'nexus3.edgexfoundry.org:10003/edgex-lftools-log-publisher:x86_64' locally
x86_64: Pulling from edgex-lftools-log-publisher
e6b0cf9c0882: Pulling fs layer
da0e9bf0cc60: Pulling fs layer
c9ea274ed700: Pulling fs layer
9cfac6ba3733: Pulling fs layer
f6a933c9cadc: Pulling fs layer
61811dbd4963: Pulling fs layer
a6eb2c9e2280: Pulling fs layer
095dd8b7b4d8: Pulling fs layer
dc21a1d4508b: Pulling fs layer
363af2e989c4: Pulling fs layer
9cfac6ba3733: Waiting
f6a933c9cadc: Waiting
61811dbd4963: Waiting
a6eb2c9e2280: Waiting
095dd8b7b4d8: Waiting
363af2e989c4: Waiting
dc21a1d4508b: Waiting
da0e9bf0cc60: Download complete
9cfac6ba3733: Verifying Checksum
9cfac6ba3733: Download complete
e6b0cf9c0882: Download complete
f6a933c9cadc: Verifying Checksum
f6a933c9cadc: Download complete
a6eb2c9e2280: Verifying Checksum
a6eb2c9e2280: Download complete
c9ea274ed700: Verifying Checksum
c9ea274ed700: Download complete
095dd8b7b4d8: Verifying Checksum
095dd8b7b4d8: Download complete
363af2e989c4: Verifying Checksum
363af2e989c4: Download complete
dc21a1d4508b: Verifying Checksum
dc21a1d4508b: Download complete
e6b0cf9c0882: Pull complete
da0e9bf0cc60: Pull complete
61811dbd4963: Verifying Checksum
61811dbd4963: Download complete
c9ea274ed700: Pull complete
9cfac6ba3733: Pull complete
f6a933c9cadc: Pull complete
61811dbd4963: Pull complete
a6eb2c9e2280: Pull complete
095dd8b7b4d8: Pull complete
dc21a1d4508b: Pull complete
363af2e989c4: Pull complete
Digest: sha256:add8188b58b49eaf945790de1a8bc2588125c85e750a42d0a8acc29426f6ed5f
Status: Downloaded newer image for nexus3.edgexfoundry.org:10003/edgex-lftools-log-publisher:x86_64
---> create-netrc.sh
+ ARCHIVE_ARTIFACTS=
+ LOGS_SERVER=https://logs.edgexfoundry.org
---> logs-deploy.sh
+ '[' https://logs.edgexfoundry.org '==' None ]
+ NEXUS_URL=https://nexus.edgexfoundry.org
+ NEXUS_PATH=production/vex-yul-edgex-jenkins-1/edgex-docs-fuji-stage-docs/114
+ BUILD_URL=https://jenkins.edgexfoundry.org/job/edgex-docs-fuji-stage-docs/114/
+ lftools deploy archives -p https://nexus.edgexfoundry.org production/vex-yul-edgex-jenkins-1/edgex-docs-fuji-stage-docs/114 <https://jenkins.edgexfoundry.org/job/edgex-docs-fuji-stage-docs/ws/>
Archives upload complete.
+ lftools deploy logs https://nexus.edgexfoundry.org production/vex-yul-edgex-jenkins-1/edgex-docs-fuji-stage-docs/114 https://jenkins.edgexfoundry.org/job/edgex-docs-fuji-stage-docs/114/
---> uname -a:
Linux 38c7b5802a7b 3.10.0-862.14.4.el7.x86_64 #1 SMP Wed Sep 26 15:12:11 UTC 2018 x86_64 Linux


---> lscpu:
Architecture: x86_64
CPU op-mode(s): 32-bit, 64-bit
Byte Order: Little Endian
Address sizes: 40 bits physical, 48 bits virtual
CPU(s): 4
On-line CPU(s) list: 0-3
Thread(s) per core: 1
Core(s) per socket: 1
Socket(s): 4
NUMA node(s): 1
Vendor ID: GenuineIntel
CPU family: 6
Model: 44
Model name: Westmere E56xx/L56xx/X56xx (IBRS update)
Stepping: 1
CPU MHz: 2933.396
BogoMIPS: 5866.79
Virtualization: VT-x
Hypervisor vendor: KVM
Virtualization type: full
L1d cache: 128 KiB
L1i cache: 128 KiB
L2 cache: 16 MiB
L3 cache: 64 MiB
NUMA node0 CPU(s): 0-3
Vulnerability L1tf: Mitigation; PTE Inversion; VMX SMT disabled, L1D conditional cache flushes
Vulnerability Meltdown: Mitigation; PTI
Vulnerability Spec store bypass: Mitigation; Speculative Store Bypass disabled via prctl and seccomp
Vulnerability Spectre v1: Mitigation; Load fences, __user pointer sanitization
Vulnerability Spectre v2: Mitigation; Full retpoline
Flags: fpu vme de pse tsc msr pae mce cx8 apic sep mtrr pge mca cmov pat pse36 clflush mmx fxsr sse sse2 ss syscall nx pdpe1gb rdtscp lm constant_tsc rep_good nopl xtopology eagerfpu pni pclmulqdq vmx ssse3 cx16 pcid sse4_1 sse4_2 x2apic popcnt tsc_deadline_timer aes hypervisor lahf_lm ssbd ibrs ibpb stibp tpr_shadow vnmi flexpriority ept vpid tsc_adjust arat spec_ctrl intel_stibp


---> nproc:
4


---> df -h:
Filesystem Size Used Available Use% Mounted on
overlay 50.0G 6.6G 43.4G 13% /
tmpfs 64.0M 0 64.0M 0% /dev
tmpfs 919.1M 0 919.1M 0% /sys/fs/cgroup
/dev/vda1 50.0G 6.6G 43.4G 13% /home/jenkins
shm 64.0M 0 64.0M 0% /dev/shm
/dev/vda1 50.0G 6.6G 43.4G 13% /etc/resolv.conf
/dev/vda1 50.0G 6.6G 43.4G 13% /etc/hostname
/dev/vda1 50.0G 6.6G 43.4G 13% /etc/hosts
/dev/vda1 50.0G 6.6G 43.4G 13% /var/log/sa
/dev/vda1 50.0G 6.6G 43.4G 13% <https://jenkins.edgexfoundry.org/job/edgex-docs-fuji-stage-docs/ws/@tmp>
/dev/vda1 50.0G 6.6G 43.4G 13% <https://jenkins.edgexfoundry.org/job/edgex-docs-fuji-stage-docs/ws/>


---> free -m:
total used free shared buff/cache available
Mem: 1838 607 68 0 1162 1125
Swap: 1023 1 1022


---> ip addr:
1: lo: <LOOPBACK,UP,LOWER_UP> mtu 65536 qdisc noqueue state UNKNOWN qlen 1000
link/loopback 00:00:00:00:00:00 brd 00:00:00:00:00:00
inet 127.0.0.1/8 scope host lo
valid_lft forever preferred_lft forever
4: eth0@if5: <BROADCAST,MULTICAST,UP,LOWER_UP,M-DOWN> mtu 1458 qdisc noqueue state UP
link/ether 02:42:0a:fa:00:01 brd ff:ff:ff:ff:ff:ff
inet 10.250.0.1/24 brd 10.250.0.255 scope global eth0
valid_lft forever preferred_lft forever


---> sar -b -r -n DEV:
Linux 3.10.0-862.14.4.el7.x86_64 (centos-7-docker-5bc7e375-1660-33dc-fe50-cb0f4dbfa1d5.vexxhost.ne) 02/23/20 _x86_64_ (4 CPU)

17:09:31 LINUX RESTART


---> sar -P ALL:
Linux 3.10.0-862.14.4.el7.x86_64 (centos-7-docker-5bc7e375-1660-33dc-fe50-cb0f4dbfa1d5.vexxhost.ne) 02/23/20 _x86_64_ (4 CPU)

17:09:31 LINUX RESTART


-----END_OF_BUILD-----
Logs upload complete.
Build logs: <a href="https://logs.edgexfoundry.org/production/vex-yul-edgex-jenkins-1/edgex-docs-fuji-stage-docs/114">https://logs.edgexfoundry.org/production/vex-yul-edgex-jenkins-1/edgex-docs-fuji-stage-docs/114</a>
+ set +x
[description-setter] Description set: Build logs: <a href="https://logs.edgexfoundry.org/production/vex-yul-edgex-jenkins-1/edgex-docs-fuji-stage-docs/114">https://logs.edgexfoundry.org/production/vex-yul-edgex-jenkins-1/edgex-docs-fuji-stage-docs/114</a>

Build failed in Jenkins: device-grove-c-snap-fuji-stage-snap-arm #102 #jenkins

Jenkins <jenkins-donotreply@...>
 

See <https://jenkins.edgexfoundry.org/job/device-grove-c-snap-fuji-stage-snap-arm/102/display/redirect>

Changes:


------------------------------------------
[...truncated 137.02 KB...]
edgex_device_svcparams params = { GROVE_SVC, "", NULL, "" };
^~~~~~~~~~~~~~~~~~~~~~
edgex_device_stop
In file included from /build/parts/edgex-device-grove/src/src/c/main.c:14:0:
/build/parts/edgex-device-grove/src/src/c/device_grove.h:39:19: warning: initialization makes integer from pointer without a cast [-Wint-conversion]
#define GROVE_SVC "Device-Grove"
^
/build/parts/edgex-device-grove/src/src/c/main.c:725:37: note: in expansion of macro ‘GROVE_SVC’
edgex_device_svcparams params = { GROVE_SVC, "", NULL, "" };
^~~~~~~~~
/build/parts/edgex-device-grove/src/src/c/device_grove.h:39:19: note: (near initialization for ‘params’)
#define GROVE_SVC "Device-Grove"
^
/build/parts/edgex-device-grove/src/src/c/main.c:725:37: note: in expansion of macro ‘GROVE_SVC’
edgex_device_svcparams params = { GROVE_SVC, "", NULL, "" };
^~~~~~~~~
/build/parts/edgex-device-grove/src/src/c/main.c:725:48: warning: excess elements in scalar initializer
edgex_device_svcparams params = { GROVE_SVC, "", NULL, "" };
^~
/build/parts/edgex-device-grove/src/src/c/main.c:725:48: note: (near initialization for ‘params’)
/build/parts/edgex-device-grove/src/src/c/main.c:725:52: warning: excess elements in scalar initializer
edgex_device_svcparams params = { GROVE_SVC, "", NULL, "" };
^~~~
/build/parts/edgex-device-grove/src/src/c/main.c:725:52: note: (near initialization for ‘params’)
/build/parts/edgex-device-grove/src/src/c/main.c:725:58: warning: excess elements in scalar initializer
edgex_device_svcparams params = { GROVE_SVC, "", NULL, "" };
^~
/build/parts/edgex-device-grove/src/src/c/main.c:725:58: note: (near initialization for ‘params’)
/build/parts/edgex-device-grove/src/src/c/main.c:731:8: warning: implicit declaration of function ‘edgex_device_service_processparams’; did you mean ‘edgex_device_service_start’? [-Wimplicit-function-declaration]
if (!edgex_device_service_processparams (&argc, argv, &params))
^~~~~~~~~~~~~~~~~~~~~~~~~~~~~~~~~~
edgex_device_service_start
/build/parts/edgex-device-grove/src/src/c/main.c:743:7: warning: implicit declaration of function ‘edgex_device_service_usage’; did you mean ‘edgex_device_service_free’? [-Wimplicit-function-declaration]
edgex_device_service_usage ();
^~~~~~~~~~~~~~~~~~~~~~~~~~
edgex_device_service_free
/build/parts/edgex-device-grove/src/src/c/main.c:766:73: error: request for member ‘svcname’ in something not a structure or union
edgex_device_service *grove_service = edgex_device_service_new (params.svcname, GROVE_VERSION, implObject, myImpls, &err);
^
/build/parts/edgex-device-grove/src/src/c/main.c:771:52: error: request for member ‘regURL’ in something not a structure or union
edgex_device_service_start (grove_service, params.regURL, params.profile, params.confdir, &err);
^
/build/parts/edgex-device-grove/src/src/c/main.c:771:67: error: request for member ‘profile’ in something not a structure or union
edgex_device_service_start (grove_service, params.regURL, params.profile, params.confdir, &err);
^
/build/parts/edgex-device-grove/src/src/c/main.c:771:83: error: request for member ‘confdir’ in something not a structure or union
edgex_device_service_start (grove_service, params.regURL, params.profile, params.confdir, &err);
^
make[2]: *** [CMakeFiles/device-grove.dir/main.c.o] Error 1
CMakeFiles/device-grove.dir/build.make:134: recipe for target 'CMakeFiles/device-grove.dir/main.c.o' failed
make[1]: *** [CMakeFiles/device-grove.dir/all] Error 2
CMakeFiles/Makefile2:67: recipe for target 'CMakeFiles/device-grove.dir/all' failed
Makefile:129: recipe for target 'all' failed
make: *** [all] Error 2
cmake /build/parts/edgex-device-grove/src/src/c -DCMAKE_INSTALL_PREFIX= -DCMAKE_BUILD_TYPE=Release
cmake --build . -- -j2
Failed to run 'cmake --build . -- -j2' for 'edgex-device-grove': Exited with code 2.
Verify that the part is using the correct parameters and try again.
Build step 'Execute shell' marked build as failure
$ ssh-agent -k
unset SSH_AUTH_SOCK;
unset SSH_AGENT_PID;
echo Agent pid 1957 killed;
[ssh-agent] Stopped.
[PostBuildScript] - [INFO] Executing post build scripts.
[device-grove-c-snap] $ /bin/bash /tmp/jenkins6758933818346721668.sh
---> sysstat.sh
2020-02-23 15:28:48.489653 WARN puppetlabs.facter - could not locate a ruby library: facts requiring Ruby will not be resolved.
2020-02-23 15:28:48.935332 WARN puppetlabs.facter - could not locate a ruby library: facts requiring Ruby will not be resolved.
End of system activity file unexpected
[device-grove-c-snap] $ /bin/bash /tmp/jenkins2724446643741585816.sh
---> package-listing.sh
++ tr '[:upper:]' '[:lower:]'
++ facter osfamily
2020-02-23 15:28:49.518319 WARN puppetlabs.facter - could not locate a ruby library: facts requiring Ruby will not be resolved.
+ OS_FAMILY=debian
+ workspace=<https://jenkins.edgexfoundry.org/job/device-grove-c-snap-fuji-stage-snap-arm/ws/>
+ START_PACKAGES=/tmp/packages_start.txt
+ END_PACKAGES=/tmp/packages_end.txt
+ DIFF_PACKAGES=/tmp/packages_diff.txt
+ PACKAGES=/tmp/packages_start.txt
+ '[' <https://jenkins.edgexfoundry.org/job/device-grove-c-snap-fuji-stage-snap-arm/ws/> ']'
+ PACKAGES=/tmp/packages_end.txt
+ case "${OS_FAMILY}" in
+ dpkg -l
+ grep '^ii'
+ '[' -f /tmp/packages_start.txt ']'
+ '[' -f /tmp/packages_end.txt ']'
+ diff /tmp/packages_start.txt /tmp/packages_end.txt
+ '[' <https://jenkins.edgexfoundry.org/job/device-grove-c-snap-fuji-stage-snap-arm/ws/> ']'
+ mkdir -p <https://jenkins.edgexfoundry.org/job/device-grove-c-snap-fuji-stage-snap-arm/ws/archives/>
+ cp -f /tmp/packages_diff.txt /tmp/packages_end.txt /tmp/packages_start.txt <https://jenkins.edgexfoundry.org/job/device-grove-c-snap-fuji-stage-snap-arm/ws/archives/>
provisioning config files...
copy managed file [jenkins-log-archives-settings] to file:<https://jenkins.edgexfoundry.org/job/device-grove-c-snap-fuji-stage-snap-arm/ws/@tmp/config1252463566228322552tmp>
[device-grove-c-snap] $ /bin/bash /tmp/jenkins4587825311885912552.sh
---> edgex-infra-ship-logs.sh
Unable to find image 'nexus3.edgexfoundry.org:10003/edgex-lftools-log-publisher:aarch64' locally
aarch64: Pulling from edgex-lftools-log-publisher
cde5963f3b93: Pulling fs layer
1cf707181fc0: Pulling fs layer
ecc8062bd8ae: Pulling fs layer
f73053cda371: Pulling fs layer
21891ac9f69c: Pulling fs layer
91256cc9b400: Pulling fs layer
1bd1ff0e301d: Pulling fs layer
55838df30d5e: Pulling fs layer
fe38a35a6fa4: Pulling fs layer
736cb92344f5: Pulling fs layer
f73053cda371: Waiting
21891ac9f69c: Waiting
91256cc9b400: Waiting
1bd1ff0e301d: Waiting
55838df30d5e: Waiting
fe38a35a6fa4: Waiting
736cb92344f5: Waiting
1cf707181fc0: Verifying Checksum
1cf707181fc0: Download complete
f73053cda371: Verifying Checksum
f73053cda371: Download complete
cde5963f3b93: Verifying Checksum
cde5963f3b93: Download complete
21891ac9f69c: Verifying Checksum
21891ac9f69c: Download complete
1bd1ff0e301d: Verifying Checksum
1bd1ff0e301d: Download complete
cde5963f3b93: Pull complete
1cf707181fc0: Pull complete
55838df30d5e: Verifying Checksum
55838df30d5e: Download complete
fe38a35a6fa4: Verifying Checksum
fe38a35a6fa4: Download complete
736cb92344f5: Verifying Checksum
736cb92344f5: Download complete
ecc8062bd8ae: Verifying Checksum
ecc8062bd8ae: Download complete
91256cc9b400: Verifying Checksum
91256cc9b400: Download complete
ecc8062bd8ae: Pull complete
f73053cda371: Pull complete
21891ac9f69c: Pull complete
91256cc9b400: Pull complete
1bd1ff0e301d: Pull complete
55838df30d5e: Pull complete
fe38a35a6fa4: Pull complete
736cb92344f5: Pull complete
Digest: sha256:e038adae1539a751c2d66fc650b1ee2b29832e64e1c88087ccfc4b874f27da29
Status: Downloaded newer image for nexus3.edgexfoundry.org:10003/edgex-lftools-log-publisher:aarch64
---> create-netrc.sh
---> logs-deploy.sh
+ ARCHIVE_ARTIFACTS=
+ LOGS_SERVER=https://logs.edgexfoundry.org
+ '[' https://logs.edgexfoundry.org '==' None ]
+ NEXUS_URL=https://nexus.edgexfoundry.org
+ NEXUS_PATH=production/vex-yul-edgex-jenkins-1/device-grove-c-snap-fuji-stage-snap-arm/102
+ BUILD_URL=https://jenkins.edgexfoundry.org/job/device-grove-c-snap-fuji-stage-snap-arm/102/
+ lftools deploy archives -p https://nexus.edgexfoundry.org production/vex-yul-edgex-jenkins-1/device-grove-c-snap-fuji-stage-snap-arm/102 <https://jenkins.edgexfoundry.org/job/device-grove-c-snap-fuji-stage-snap-arm/ws/>
Archives upload complete.
+ lftools deploy logs https://nexus.edgexfoundry.org production/vex-yul-edgex-jenkins-1/device-grove-c-snap-fuji-stage-snap-arm/102 https://jenkins.edgexfoundry.org/job/device-grove-c-snap-fuji-stage-snap-arm/102/
---> uname -a:
Linux 3080b00ef4ad 4.15.0-38-generic #41-Ubuntu SMP Wed Oct 10 10:59:31 UTC 2018 aarch64 Linux


---> lscpu:
Architecture: aarch64
CPU op-mode(s): 64-bit
Byte Order: Little Endian
CPU(s): 2
On-line CPU(s) list: 0,1
Thread(s) per core: 1
Core(s) per socket: 2
Socket(s): 1
NUMA node(s): 1
Vendor ID: Cavium
Model: 1
Model name: ThunderX 88XX
Stepping: 0x1
BogoMIPS: 200.00
NUMA node0 CPU(s): 0,1
Flags: fp asimd evtstrm aes pmull sha1 sha2 crc32 cpuid


---> nproc:
2


---> df -h:
Filesystem Size Used Available Use% Mounted on
overlay 38.6G 6.1G 32.5G 16% /
tmpfs 64.0M 0 64.0M 0% /dev
tmpfs 3.9G 0 3.9G 0% /sys/fs/cgroup
/dev/vda1 38.6G 6.1G 32.5G 16% /home/jenkins
shm 64.0M 0 64.0M 0% /dev/shm
/dev/vda1 38.6G 6.1G 32.5G 16% /etc/resolv.conf
/dev/vda1 38.6G 6.1G 32.5G 16% /etc/hostname
/dev/vda1 38.6G 6.1G 32.5G 16% /etc/hosts
/dev/vda1 38.6G 6.1G 32.5G 16% /var/log/sa
/dev/vda1 38.6G 6.1G 32.5G 16% <https://jenkins.edgexfoundry.org/job/device-grove-c-snap-fuji-stage-snap-arm/ws/>
/dev/vda1 38.6G 6.1G 32.5G 16% <https://jenkins.edgexfoundry.org/job/device-grove-c-snap-fuji-stage-snap-arm/ws/@tmp>


---> free -m:
total used free shared buff/cache available
Mem: 7973 657 4495 0 2821 7313
Swap: 1023 0 1023


---> ip addr:
1: lo: <LOOPBACK,UP,LOWER_UP> mtu 65536 qdisc noqueue state UNKNOWN qlen 1000
link/loopback 00:00:00:00:00:00 brd 00:00:00:00:00:00
inet 127.0.0.1/8 scope host lo
valid_lft forever preferred_lft forever
10: eth0@if11: <BROADCAST,MULTICAST,UP,LOWER_UP,M-DOWN> mtu 1458 qdisc noqueue state UP
link/ether 02:42:0a:fa:00:01 brd ff:ff:ff:ff:ff:ff
inet 10.250.0.1/24 brd 10.250.0.255 scope global eth0
valid_lft forever preferred_lft forever


Invalid system activity file: /var/log/sa/sa23
File created by sar/sadc from sysstat version 11.6.1
Current sysstat version cannot read the format of this file (0x2173)
Traceback (most recent call last):
File "/usr/local/bin/lftools", line 8, in <module>
sys.exit(main())
File "/usr/local/lib/python3.8/site-packages/lftools/cli/__init__.py", line 110, in main
cli(obj={})
File "/usr/local/lib/python3.8/site-packages/click/core.py", line 764, in __call__
return self.main(*args, **kwargs)
File "/usr/local/lib/python3.8/site-packages/click/core.py", line 717, in main
rv = self.invoke(ctx)
File "/usr/local/lib/python3.8/site-packages/click/core.py", line 1137, in invoke
return _process_result(sub_ctx.command.invoke(sub_ctx))
File "/usr/local/lib/python3.8/site-packages/click/core.py", line 1137, in invoke
return _process_result(sub_ctx.command.invoke(sub_ctx))
File "/usr/local/lib/python3.8/site-packages/click/core.py", line 956, in invoke
return ctx.invoke(self.callback, **ctx.params)
File "/usr/local/lib/python3.8/site-packages/click/core.py", line 555, in invoke
return callback(*args, **kwargs)
File "/usr/local/lib/python3.8/site-packages/click/decorators.py", line 17, in new_func
return f(get_current_context(), *args, **kwargs)
File "/usr/local/lib/python3.8/site-packages/lftools/cli/deploy.py", line 139, in logs
deploy_sys.deploy_logs(nexus_url, nexus_path, build_url)
File "/usr/local/lib/python3.8/site-packages/lftools/deploy.py", line 293, in deploy_logs
output = subprocess.check_output(c).decode('utf-8')
File "/usr/local/lib/python3.8/subprocess.py", line 411, in check_output
return run(*popenargs, stdout=PIPE, timeout=timeout, check=True,
File "/usr/local/lib/python3.8/subprocess.py", line 512, in run
raise CalledProcessError(retcode, process.args,
subprocess.CalledProcessError: Command '['sar', '-b', '-r', '-n', 'DEV']' returned non-zero exit status 3.
[description-setter] Could not determine description.

Build failed in Jenkins: device-grove-c-snap-master-stage-snap #239 #jenkins

Jenkins <jenkins-donotreply@...>
 

See <https://jenkins.edgexfoundry.org/job/device-grove-c-snap-master-stage-snap/239/display/redirect>

Changes:


------------------------------------------
[...truncated 141.97 KB...]
---> sysstat.sh
[device-grove-c-snap] $ /bin/bash /tmp/jenkins4485605974447817858.sh
---> package-listing.sh
++ facter osfamily
++ tr '[:upper:]' '[:lower:]'
+ OS_FAMILY=redhat
+ workspace=<https://jenkins.edgexfoundry.org/job/device-grove-c-snap-master-stage-snap/ws/>
+ START_PACKAGES=/tmp/packages_start.txt
+ END_PACKAGES=/tmp/packages_end.txt
+ DIFF_PACKAGES=/tmp/packages_diff.txt
+ PACKAGES=/tmp/packages_start.txt
+ '[' <https://jenkins.edgexfoundry.org/job/device-grove-c-snap-master-stage-snap/ws/> ']'
+ PACKAGES=/tmp/packages_end.txt
+ case "${OS_FAMILY}" in
+ rpm -qa
+ sort
+ '[' -f /tmp/packages_start.txt ']'
+ '[' -f /tmp/packages_end.txt ']'
+ diff /tmp/packages_start.txt /tmp/packages_end.txt
+ '[' <https://jenkins.edgexfoundry.org/job/device-grove-c-snap-master-stage-snap/ws/> ']'
+ mkdir -p <https://jenkins.edgexfoundry.org/job/device-grove-c-snap-master-stage-snap/ws/archives/>
+ cp -f /tmp/packages_diff.txt /tmp/packages_end.txt /tmp/packages_start.txt <https://jenkins.edgexfoundry.org/job/device-grove-c-snap-master-stage-snap/ws/archives/>
provisioning config files...
copy managed file [jenkins-log-archives-settings] to file:<https://jenkins.edgexfoundry.org/job/device-grove-c-snap-master-stage-snap/ws/@tmp/config5276037375592303196tmp>
[device-grove-c-snap] $ /bin/bash /tmp/jenkins872866249313871170.sh
---> edgex-infra-ship-logs.sh
Unable to find image 'nexus3.edgexfoundry.org:10003/edgex-lftools-log-publisher:x86_64' locally
x86_64: Pulling from edgex-lftools-log-publisher
e6b0cf9c0882: Pulling fs layer
da0e9bf0cc60: Pulling fs layer
c9ea274ed700: Pulling fs layer
9cfac6ba3733: Pulling fs layer
f6a933c9cadc: Pulling fs layer
61811dbd4963: Pulling fs layer
a6eb2c9e2280: Pulling fs layer
095dd8b7b4d8: Pulling fs layer
dc21a1d4508b: Pulling fs layer
363af2e989c4: Pulling fs layer
61811dbd4963: Waiting
a6eb2c9e2280: Waiting
095dd8b7b4d8: Waiting
dc21a1d4508b: Waiting
363af2e989c4: Waiting
9cfac6ba3733: Waiting
f6a933c9cadc: Waiting
da0e9bf0cc60: Download complete
9cfac6ba3733: Verifying Checksum
9cfac6ba3733: Download complete
e6b0cf9c0882: Verifying Checksum
e6b0cf9c0882: Download complete
f6a933c9cadc: Verifying Checksum
f6a933c9cadc: Download complete
a6eb2c9e2280: Verifying Checksum
a6eb2c9e2280: Download complete
e6b0cf9c0882: Pull complete
c9ea274ed700: Verifying Checksum
c9ea274ed700: Download complete
095dd8b7b4d8: Verifying Checksum
095dd8b7b4d8: Download complete
363af2e989c4: Verifying Checksum
363af2e989c4: Download complete
dc21a1d4508b: Verifying Checksum
dc21a1d4508b: Download complete
da0e9bf0cc60: Pull complete
61811dbd4963: Verifying Checksum
61811dbd4963: Download complete
c9ea274ed700: Pull complete
9cfac6ba3733: Pull complete
f6a933c9cadc: Pull complete
61811dbd4963: Pull complete
a6eb2c9e2280: Pull complete
095dd8b7b4d8: Pull complete
dc21a1d4508b: Pull complete
363af2e989c4: Pull complete
Digest: sha256:add8188b58b49eaf945790de1a8bc2588125c85e750a42d0a8acc29426f6ed5f
Status: Downloaded newer image for nexus3.edgexfoundry.org:10003/edgex-lftools-log-publisher:x86_64
---> create-netrc.sh
---> logs-deploy.sh
+ ARCHIVE_ARTIFACTS=
+ LOGS_SERVER=https://logs.edgexfoundry.org
+ '[' https://logs.edgexfoundry.org '==' None ]
+ NEXUS_URL=https://nexus.edgexfoundry.org
+ NEXUS_PATH=production/vex-yul-edgex-jenkins-1/device-grove-c-snap-master-stage-snap/239
+ BUILD_URL=https://jenkins.edgexfoundry.org/job/device-grove-c-snap-master-stage-snap/239/
+ lftools deploy archives -p https://nexus.edgexfoundry.org production/vex-yul-edgex-jenkins-1/device-grove-c-snap-master-stage-snap/239 <https://jenkins.edgexfoundry.org/job/device-grove-c-snap-master-stage-snap/ws/>
Archives upload complete.
+ lftools deploy logs https://nexus.edgexfoundry.org production/vex-yul-edgex-jenkins-1/device-grove-c-snap-master-stage-snap/239 https://jenkins.edgexfoundry.org/job/device-grove-c-snap-master-stage-snap/239/
---> uname -a:
Linux 43071026bf05 3.10.0-862.14.4.el7.x86_64 #1 SMP Wed Sep 26 15:12:11 UTC 2018 x86_64 Linux


---> lscpu:
Architecture: x86_64
CPU op-mode(s): 32-bit, 64-bit
Byte Order: Little Endian
Address sizes: 40 bits physical, 48 bits virtual
CPU(s): 4
On-line CPU(s) list: 0-3
Thread(s) per core: 1
Core(s) per socket: 1
Socket(s): 4
NUMA node(s): 1
Vendor ID: GenuineIntel
CPU family: 6
Model: 44
Model name: Westmere E56xx/L56xx/X56xx (IBRS update)
Stepping: 1
CPU MHz: 2933.438
BogoMIPS: 5866.87
Virtualization: VT-x
Hypervisor vendor: KVM
Virtualization type: full
L1d cache: 128 KiB
L1i cache: 128 KiB
L2 cache: 16 MiB
L3 cache: 64 MiB
NUMA node0 CPU(s): 0-3
Vulnerability L1tf: Mitigation; PTE Inversion; VMX SMT disabled, L1D conditional cache flushes
Vulnerability Meltdown: Mitigation; PTI
Vulnerability Spec store bypass: Mitigation; Speculative Store Bypass disabled via prctl and seccomp
Vulnerability Spectre v1: Mitigation; Load fences, __user pointer sanitization
Vulnerability Spectre v2: Mitigation; Full retpoline
Flags: fpu vme de pse tsc msr pae mce cx8 apic sep mtrr pge mca cmov pat pse36 clflush mmx fxsr sse sse2 ss syscall nx pdpe1gb rdtscp lm constant_tsc rep_good nopl xtopology eagerfpu pni pclmulqdq vmx ssse3 cx16 pcid sse4_1 sse4_2 x2apic popcnt tsc_deadline_timer aes hypervisor lahf_lm ssbd ibrs ibpb stibp tpr_shadow vnmi flexpriority ept vpid tsc_adjust arat spec_ctrl intel_stibp


---> nproc:
4


---> df -h:
Filesystem Size Used Available Use% Mounted on
overlay 50.0G 7.1G 42.9G 14% /
tmpfs 64.0M 0 64.0M 0% /dev
tmpfs 919.1M 0 919.1M 0% /sys/fs/cgroup
/dev/vda1 50.0G 7.1G 42.9G 14% /home/jenkins
shm 64.0M 0 64.0M 0% /dev/shm
/dev/vda1 50.0G 7.1G 42.9G 14% /etc/resolv.conf
/dev/vda1 50.0G 7.1G 42.9G 14% /etc/hostname
/dev/vda1 50.0G 7.1G 42.9G 14% /etc/hosts
/dev/vda1 50.0G 7.1G 42.9G 14% /var/log/sa
/dev/vda1 50.0G 7.1G 42.9G 14% <https://jenkins.edgexfoundry.org/job/device-grove-c-snap-master-stage-snap/ws/>
/dev/vda1 50.0G 7.1G 42.9G 14% <https://jenkins.edgexfoundry.org/job/device-grove-c-snap-master-stage-snap/ws/@tmp>


---> free -m:
total used free shared buff/cache available
Mem: 1838 695 106 0 1036 1060
Swap: 1023 2 1021


---> ip addr:
1: lo: <LOOPBACK,UP,LOWER_UP> mtu 65536 qdisc noqueue state UNKNOWN qlen 1000
link/loopback 00:00:00:00:00:00 brd 00:00:00:00:00:00
inet 127.0.0.1/8 scope host lo
valid_lft forever preferred_lft forever
10: eth0@if11: <BROADCAST,MULTICAST,UP,LOWER_UP,M-DOWN> mtu 1458 qdisc noqueue state UP
link/ether 02:42:0a:fa:00:01 brd ff:ff:ff:ff:ff:ff
inet 10.250.0.1/24 brd 10.250.0.255 scope global eth0
valid_lft forever preferred_lft forever


---> sar -b -r -n DEV:
Linux 3.10.0-862.14.4.el7.x86_64 (centos-7-docker-5bc7e375-1660-33dc-fe50-cb0f4dbfa1d5.vexxhost.ne) 02/23/20 _x86_64_ (4 CPU)

13:26:32 LINUX RESTART

13:27:02 tps rtps wtps bread/s bwrtn/s
13:28:01 184.96 19.77 165.19 3056.85 32010.37
13:29:01 585.85 411.96 173.89 22535.31 30316.18
13:30:01 289.95 94.97 194.97 4963.25 25680.88
13:31:02 104.69 47.07 57.62 2483.49 4134.19
13:32:01 67.19 38.44 28.75 2880.73 2098.49
Average: 247.31 122.97 124.34 7208.91 18882.44

13:27:02 kbmemfree kbmemused %memused kbbuffers kbcached kbcommit %commit kbactive kbinact kbdirty
13:28:01 67492 1814812 96.41 2620 1051924 1344900 45.89 495776 1045564 70248
13:29:01 77556 1804748 95.88 2448 1109376 1099072 37.50 493236 1030056 70536
13:30:01 108372 1773932 94.24 1992 975332 1159960 39.58 604684 908244 5872
13:31:02 204580 1677724 89.13 1840 932668 1091212 37.23 533628 869600 12008
13:32:01 590592 1291712 68.62 1840 625296 943968 32.21 431248 599792 1824
Average: 209718 1672586 88.86 2148 938919 1127822 38.48 511714 890651 32098

13:27:02 IFACE rxpck/s txpck/s rxkB/s txkB/s rxcmp/s txcmp/s rxmcst/s
13:28:01 eth0 734.69 525.79 4935.43 81.43 0.00 0.00 0.00
13:28:01 lo 0.00 0.00 0.00 0.00 0.00 0.00 0.00
13:28:01 veth53a6a1d 309.26 378.70 22.39 3950.95 0.00 0.00 0.00
13:28:01 docker0 309.26 378.56 18.16 3950.93 0.00 0.00 0.00
13:29:01 eth0 1.40 0.93 0.63 0.19 0.00 0.00 0.00
13:29:01 lo 0.00 0.00 0.00 0.00 0.00 0.00 0.00
13:29:01 docker0 0.00 0.00 0.00 0.00 0.00 0.00 0.00
13:30:01 veth14d3872 155.89 214.15 11.63 2002.03 0.00 0.00 0.00
13:30:01 eth0 998.55 711.38 6949.41 98.00 0.00 0.00 0.00
13:30:01 lo 0.10 0.10 0.01 0.01 0.00 0.00 0.00
13:30:01 docker0 462.27 589.05 27.49 5916.12 0.00 0.00 0.00
13:31:02 veth14d3872 23.20 27.53 1.94 98.34 0.00 0.00 0.00
13:31:02 eth0 46.02 40.63 102.35 6.27 0.00 0.00 0.00
13:31:02 lo 0.00 0.00 0.00 0.00 0.00 0.00 0.00
13:31:02 docker0 23.20 27.53 1.62 98.34 0.00 0.00 0.00
13:32:01 eth0 160.65 138.22 567.29 22.24 0.00 0.00 0.00
13:32:01 lo 0.00 0.00 0.00 0.00 0.00 0.00 0.00
13:32:01 docker0 107.84 114.56 5.87 522.34 0.00 0.00 0.00
Average: eth0 233.46 174.23 1518.80 24.92 0.00 0.00 0.00
Average: lo 0.00 0.00 0.00 0.00 0.00 0.00 0.00
Average: docker0 118.90 146.59 7.01 1312.27 0.00 0.00 0.00


---> sar -P ALL:
Linux 3.10.0-862.14.4.el7.x86_64 (centos-7-docker-5bc7e375-1660-33dc-fe50-cb0f4dbfa1d5.vexxhost.ne) 02/23/20 _x86_64_ (4 CPU)

13:26:32 LINUX RESTART

13:27:02 CPU %user %nice %system %iowait %steal %idle
13:28:01 all 19.51 0.00 7.63 3.76 0.03 69.07
13:28:01 0 21.05 0.00 9.77 2.65 0.03 66.50
13:28:01 1 16.32 0.00 5.98 2.73 0.05 74.91
13:28:01 2 24.78 0.00 7.41 3.26 0.03 64.51
13:28:01 3 15.91 0.00 7.38 6.39 0.02 70.30
13:29:01 all 7.59 0.00 6.32 14.49 0.06 71.54
13:29:01 0 8.37 0.00 6.04 14.14 0.07 71.38
13:29:01 1 6.40 0.00 6.56 15.05 0.05 71.94
13:29:01 2 6.87 0.00 6.20 14.12 0.07 72.74
13:29:01 3 8.70 0.00 6.46 14.65 0.05 70.14
13:30:01 all 8.10 0.00 6.19 3.87 0.05 81.79
13:30:01 0 14.45 0.00 7.70 4.47 0.05 73.33
13:30:01 1 4.84 0.00 5.13 3.28 0.05 86.71
13:30:01 2 6.89 0.00 5.98 4.89 0.03 82.20
13:30:01 3 6.27 0.00 5.93 2.87 0.05 84.87
13:31:02 all 23.42 0.00 7.24 0.97 0.03 68.34
13:31:02 0 17.37 0.00 7.25 1.02 0.05 74.30
13:31:02 1 19.29 0.00 6.44 1.31 0.02 72.94
13:31:02 2 23.71 0.00 8.21 0.64 0.05 67.39
13:31:02 3 33.32 0.00 7.06 0.91 0.03 58.67
13:32:01 all 9.60 0.00 3.60 1.03 0.02 85.76
13:32:01 0 6.79 0.00 3.38 0.12 0.02 89.69
13:32:01 1 10.06 0.00 3.87 1.11 0.00 84.97
13:32:01 2 10.81 0.00 3.42 2.55 0.02 83.21
13:32:01 3 10.75 0.00 3.77 0.31 0.00 85.17
Average: all 13.66 0.00 6.20 4.82 0.04 75.28
Average: 0 13.62 0.00 6.83 4.49 0.04 75.02
Average: 1 11.39 0.00 5.60 4.69 0.03 78.29
Average: 2 14.62 0.00 6.25 5.09 0.04 74.00
Average: 3 15.02 0.00 6.13 5.01 0.03 73.81


-----END_OF_BUILD-----
Logs upload complete.
Build logs: <a href="https://logs.edgexfoundry.org/production/vex-yul-edgex-jenkins-1/device-grove-c-snap-master-stage-snap/239">https://logs.edgexfoundry.org/production/vex-yul-edgex-jenkins-1/device-grove-c-snap-master-stage-snap/239</a>
+ set +x
[description-setter] Description set: Build logs: <a href="https://logs.edgexfoundry.org/production/vex-yul-edgex-jenkins-1/device-grove-c-snap-master-stage-snap/239">https://logs.edgexfoundry.org/production/vex-yul-edgex-jenkins-1/device-grove-c-snap-master-stage-snap/239</a>

Build failed in Jenkins: device-mqtt-go-snap-master-stage-snap-arm #281 #jenkins

Jenkins <jenkins-donotreply@...>
 

See <https://jenkins.edgexfoundry.org/job/device-mqtt-go-snap-master-stage-snap-arm/281/display/redirect>

Changes:


------------------------------------------
[...truncated 43.99 KB...]
go: finding golang.org/x/sync v0.0.0-20181221193216-37e7f081c4d4
go: finding github.com/pascaldekloe/goe v0.0.0-20180627143212-57f6aae5913c
go: finding github.com/hashicorp/go-sockaddr v1.0.0
go: finding github.com/posener/complete v1.1.1
go: finding github.com/google/btree v0.0.0-20180813153112-4030bb1f1f0c
go: finding golang.org/x/sys v0.0.0-20181026203630-95b1ffbd15a5
go: finding github.com/fatih/color v1.7.0
go: finding github.com/armon/go-radix v0.0.0-20180808171621-7fddfc383310
go: finding github.com/mattn/go-colorable v0.0.9
go: finding github.com/hashicorp/go-immutable-radix v1.0.0
go: finding github.com/hashicorp/go.net v0.0.1
go: finding github.com/miekg/dns v1.0.14
go: finding golang.org/x/sys v0.0.0-20180823144017-11551d06cbcc
go: finding github.com/bgentry/speakeasy v0.1.0
go: finding github.com/mattn/go-isatty v0.0.3
go: finding github.com/hashicorp/errwrap v1.0.0
go: finding github.com/hashicorp/go-uuid v1.0.0
go: finding github.com/hashicorp/golang-lru v0.5.0
go: finding golang.org/x/crypto v0.0.0-20181029021203-45a5f77698d3
go: downloading github.com/edgexfoundry/device-sdk-go v0.0.0-20191023171807-49a95f741ef7
go: downloading github.com/edgexfoundry/go-mod-core-contracts v0.1.31
go: downloading github.com/spf13/cast v1.3.0
go: downloading github.com/eclipse/paho.mqtt.golang v1.1.1
go: downloading gopkg.in/mgo.v2 v2.0.0-20180705113604-9856a29383ce
go: downloading golang.org/x/net v0.0.0-20190213061140-3a22650c66bd
go: downloading github.com/pelletier/go-toml v1.2.0
go: downloading github.com/google/uuid v1.1.1
go: downloading github.com/edgexfoundry/go-mod-registry v0.1.0
go: downloading github.com/ugorji/go v1.1.4
go: downloading github.com/hashicorp/consul v1.4.2
go: downloading github.com/gorilla/mux v1.7.0
go: downloading github.com/pkg/errors v0.8.1
go: downloading gopkg.in/yaml.v2 v2.2.2
go: downloading github.com/mitchellh/consulstructure v0.0.0-20190329231841-56fdc4d2da54
go: downloading github.com/mitchellh/mapstructure v1.1.2
go: downloading github.com/go-kit/kit v0.8.0
go: downloading github.com/cenkalti/backoff v2.1.1+incompatible
go: downloading github.com/mitchellh/copystructure v1.0.0
go: downloading github.com/mitchellh/reflectwalk v1.0.0
go: downloading github.com/go-logfmt/logfmt v0.4.0
go: downloading github.com/hashicorp/go-cleanhttp v0.5.0
go: downloading github.com/hashicorp/go-rootcerts v1.0.0
go: downloading github.com/hashicorp/serf v0.8.2
go: downloading github.com/armon/go-metrics v0.0.0-20180917152333-f0300d1749da
go: downloading github.com/hashicorp/go-immutable-radix v1.0.0
go: downloading github.com/hashicorp/golang-lru v0.5.0
CGO_ENABLED=0 GO111MODULE=on go build ./...
Skipping stage go (already ran)
Staging device-mqtt
Priming go
Priming device-mqtt
DEPRECATED: The 'version-script' keyword has been deprecated in favour of the 'snapcraftctl set-version' part scriptlet.
See http://snapcraft.io/docs/deprecation-notices/dn10 for more information.
Determining the version from the project repo (version-script).
cat: VERSION: No such file or directory
The version has been set to '-20200223+7630a44'
error: cannot validate snap "edgex-device-mqtt": invalid snap version "-20200223+7630a44": must start with an ASCII alphanumeric (and not '-')
Failed to verify directory to pack.
Build step 'Execute shell' marked build as failure
$ ssh-agent -k
unset SSH_AUTH_SOCK;
unset SSH_AGENT_PID;
echo Agent pid 1949 killed;
[ssh-agent] Stopped.
[PostBuildScript] - [INFO] Executing post build scripts.
[device-mqtt-go-snap] $ /bin/bash /tmp/jenkins3121575390184841037.sh
---> sysstat.sh
2020-02-23 12:18:20.938527 WARN puppetlabs.facter - could not locate a ruby library: facts requiring Ruby will not be resolved.
2020-02-23 12:18:21.338228 WARN puppetlabs.facter - could not locate a ruby library: facts requiring Ruby will not be resolved.
End of system activity file unexpected
[device-mqtt-go-snap] $ /bin/bash /tmp/jenkins3503072651027372671.sh
---> package-listing.sh
++ facter osfamily
++ tr '[:upper:]' '[:lower:]'
2020-02-23 12:18:21.910878 WARN puppetlabs.facter - could not locate a ruby library: facts requiring Ruby will not be resolved.
+ OS_FAMILY=debian
+ workspace=<https://jenkins.edgexfoundry.org/job/device-mqtt-go-snap-master-stage-snap-arm/ws/>
+ START_PACKAGES=/tmp/packages_start.txt
+ END_PACKAGES=/tmp/packages_end.txt
+ DIFF_PACKAGES=/tmp/packages_diff.txt
+ PACKAGES=/tmp/packages_start.txt
+ '[' <https://jenkins.edgexfoundry.org/job/device-mqtt-go-snap-master-stage-snap-arm/ws/> ']'
+ PACKAGES=/tmp/packages_end.txt
+ case "${OS_FAMILY}" in
+ grep '^ii'
+ dpkg -l
+ '[' -f /tmp/packages_start.txt ']'
+ '[' -f /tmp/packages_end.txt ']'
+ diff /tmp/packages_start.txt /tmp/packages_end.txt
+ '[' <https://jenkins.edgexfoundry.org/job/device-mqtt-go-snap-master-stage-snap-arm/ws/> ']'
+ mkdir -p <https://jenkins.edgexfoundry.org/job/device-mqtt-go-snap-master-stage-snap-arm/ws/archives/>
+ cp -f /tmp/packages_diff.txt /tmp/packages_end.txt /tmp/packages_start.txt <https://jenkins.edgexfoundry.org/job/device-mqtt-go-snap-master-stage-snap-arm/ws/archives/>
provisioning config files...
copy managed file [jenkins-log-archives-settings] to file:<https://jenkins.edgexfoundry.org/job/device-mqtt-go-snap-master-stage-snap-arm/ws/@tmp/config8311818336987721779tmp>
[device-mqtt-go-snap] $ /bin/bash /tmp/jenkins8562092195879149816.sh
---> edgex-infra-ship-logs.sh
Unable to find image 'nexus3.edgexfoundry.org:10003/edgex-lftools-log-publisher:aarch64' locally
aarch64: Pulling from edgex-lftools-log-publisher
cde5963f3b93: Pulling fs layer
1cf707181fc0: Pulling fs layer
ecc8062bd8ae: Pulling fs layer
f73053cda371: Pulling fs layer
21891ac9f69c: Pulling fs layer
91256cc9b400: Pulling fs layer
1bd1ff0e301d: Pulling fs layer
55838df30d5e: Pulling fs layer
fe38a35a6fa4: Pulling fs layer
736cb92344f5: Pulling fs layer
f73053cda371: Waiting
21891ac9f69c: Waiting
91256cc9b400: Waiting
1bd1ff0e301d: Waiting
55838df30d5e: Waiting
fe38a35a6fa4: Waiting
736cb92344f5: Waiting
1cf707181fc0: Verifying Checksum
1cf707181fc0: Download complete
f73053cda371: Verifying Checksum
f73053cda371: Download complete
cde5963f3b93: Verifying Checksum
cde5963f3b93: Download complete
21891ac9f69c: Verifying Checksum
21891ac9f69c: Download complete
1bd1ff0e301d: Verifying Checksum
1bd1ff0e301d: Download complete
cde5963f3b93: Pull complete
1cf707181fc0: Pull complete
55838df30d5e: Verifying Checksum
55838df30d5e: Download complete
fe38a35a6fa4: Verifying Checksum
fe38a35a6fa4: Download complete
736cb92344f5: Verifying Checksum
736cb92344f5: Download complete
ecc8062bd8ae: Verifying Checksum
ecc8062bd8ae: Download complete
91256cc9b400: Verifying Checksum
91256cc9b400: Download complete
ecc8062bd8ae: Pull complete
f73053cda371: Pull complete
21891ac9f69c: Pull complete
91256cc9b400: Pull complete
1bd1ff0e301d: Pull complete
55838df30d5e: Pull complete
fe38a35a6fa4: Pull complete
736cb92344f5: Pull complete
Digest: sha256:e038adae1539a751c2d66fc650b1ee2b29832e64e1c88087ccfc4b874f27da29
Status: Downloaded newer image for nexus3.edgexfoundry.org:10003/edgex-lftools-log-publisher:aarch64
---> create-netrc.sh
+ ARCHIVE_ARTIFACTS=
+ LOGS_SERVER=https://logs.edgexfoundry.org
+ '[' https://logs.edgexfoundry.org '==' None ]
+ NEXUS_URL=https://nexus.edgexfoundry.org
+ NEXUS_PATH=production/vex-yul-edgex-jenkins-1/device-mqtt-go-snap-master-stage-snap-arm/281
+ BUILD_URL=https://jenkins.edgexfoundry.org/job/device-mqtt-go-snap-master-stage-snap-arm/281/
+ lftools deploy archives -p https://nexus.edgexfoundry.org production/vex-yul-edgex-jenkins-1/device-mqtt-go-snap-master-stage-snap-arm/281 <https://jenkins.edgexfoundry.org/job/device-mqtt-go-snap-master-stage-snap-arm/ws/>
---> logs-deploy.sh
Archives upload complete.
+ lftools deploy logs https://nexus.edgexfoundry.org production/vex-yul-edgex-jenkins-1/device-mqtt-go-snap-master-stage-snap-arm/281 https://jenkins.edgexfoundry.org/job/device-mqtt-go-snap-master-stage-snap-arm/281/
---> uname -a:
Linux 8e56bf370ab2 4.15.0-38-generic #41-Ubuntu SMP Wed Oct 10 10:59:31 UTC 2018 aarch64 Linux


---> lscpu:
Architecture: aarch64
CPU op-mode(s): 64-bit
Byte Order: Little Endian
CPU(s): 2
On-line CPU(s) list: 0,1
Thread(s) per core: 1
Core(s) per socket: 2
Socket(s): 1
NUMA node(s): 1
Vendor ID: Cavium
Model: 1
Model name: ThunderX 88XX
Stepping: 0x1
BogoMIPS: 200.00
NUMA node0 CPU(s): 0,1
Flags: fp asimd evtstrm aes pmull sha1 sha2 crc32 cpuid


---> nproc:
2


---> df -h:
Filesystem Size Used Available Use% Mounted on
overlay 38.6G 6.1G 32.5G 16% /
tmpfs 64.0M 0 64.0M 0% /dev
tmpfs 3.9G 0 3.9G 0% /sys/fs/cgroup
/dev/vda1 38.6G 6.1G 32.5G 16% /home/jenkins
shm 64.0M 0 64.0M 0% /dev/shm
/dev/vda1 38.6G 6.1G 32.5G 16% /etc/resolv.conf
/dev/vda1 38.6G 6.1G 32.5G 16% /etc/hostname
/dev/vda1 38.6G 6.1G 32.5G 16% /etc/hosts
/dev/vda1 38.6G 6.1G 32.5G 16% /var/log/sa
/dev/vda1 38.6G 6.1G 32.5G 16% <https://jenkins.edgexfoundry.org/job/device-mqtt-go-snap-master-stage-snap-arm/ws/>
/dev/vda1 38.6G 6.1G 32.5G 16% <https://jenkins.edgexfoundry.org/job/device-mqtt-go-snap-master-stage-snap-arm/ws/@tmp>


---> free -m:
total used free shared buff/cache available
Mem: 7973 642 4515 0 2816 7319
Swap: 1023 0 1023


---> ip addr:
1: lo: <LOOPBACK,UP,LOWER_UP> mtu 65536 qdisc noqueue state UNKNOWN qlen 1000
link/loopback 00:00:00:00:00:00 brd 00:00:00:00:00:00
inet 127.0.0.1/8 scope host lo
valid_lft forever preferred_lft forever
10: eth0@if11: <BROADCAST,MULTICAST,UP,LOWER_UP,M-DOWN> mtu 1458 qdisc noqueue state UP
link/ether 02:42:0a:fa:00:01 brd ff:ff:ff:ff:ff:ff
inet 10.250.0.1/24 brd 10.250.0.255 scope global eth0
valid_lft forever preferred_lft forever


Invalid system activity file: /var/log/sa/sa23
File created by sar/sadc from sysstat version 11.6.1
Current sysstat version cannot read the format of this file (0x2173)
Traceback (most recent call last):
File "/usr/local/bin/lftools", line 8, in <module>
sys.exit(main())
File "/usr/local/lib/python3.8/site-packages/lftools/cli/__init__.py", line 110, in main
cli(obj={})
File "/usr/local/lib/python3.8/site-packages/click/core.py", line 764, in __call__
return self.main(*args, **kwargs)
File "/usr/local/lib/python3.8/site-packages/click/core.py", line 717, in main
rv = self.invoke(ctx)
File "/usr/local/lib/python3.8/site-packages/click/core.py", line 1137, in invoke
return _process_result(sub_ctx.command.invoke(sub_ctx))
File "/usr/local/lib/python3.8/site-packages/click/core.py", line 1137, in invoke
return _process_result(sub_ctx.command.invoke(sub_ctx))
File "/usr/local/lib/python3.8/site-packages/click/core.py", line 956, in invoke
return ctx.invoke(self.callback, **ctx.params)
File "/usr/local/lib/python3.8/site-packages/click/core.py", line 555, in invoke
return callback(*args, **kwargs)
File "/usr/local/lib/python3.8/site-packages/click/decorators.py", line 17, in new_func
return f(get_current_context(), *args, **kwargs)
File "/usr/local/lib/python3.8/site-packages/lftools/cli/deploy.py", line 139, in logs
deploy_sys.deploy_logs(nexus_url, nexus_path, build_url)
File "/usr/local/lib/python3.8/site-packages/lftools/deploy.py", line 293, in deploy_logs
output = subprocess.check_output(c).decode('utf-8')
File "/usr/local/lib/python3.8/subprocess.py", line 411, in check_output
return run(*popenargs, stdout=PIPE, timeout=timeout, check=True,
File "/usr/local/lib/python3.8/subprocess.py", line 512, in run
raise CalledProcessError(retcode, process.args,
subprocess.CalledProcessError: Command '['sar', '-b', '-r', '-n', 'DEV']' returned non-zero exit status 3.
[description-setter] Could not determine description.

Build failed in Jenkins: device-mqtt-go-snap-master-stage-snap #281 #jenkins

Jenkins <jenkins-donotreply@...>
 

See <https://jenkins.edgexfoundry.org/job/device-mqtt-go-snap-master-stage-snap/281/display/redirect>

Changes:


------------------------------------------
[...truncated 47.13 KB...]
---> package-listing.sh
++ facter osfamily
++ tr '[:upper:]' '[:lower:]'
+ OS_FAMILY=redhat
+ workspace=<https://jenkins.edgexfoundry.org/job/device-mqtt-go-snap-master-stage-snap/ws/>
+ START_PACKAGES=/tmp/packages_start.txt
+ END_PACKAGES=/tmp/packages_end.txt
+ DIFF_PACKAGES=/tmp/packages_diff.txt
+ PACKAGES=/tmp/packages_start.txt
+ '[' <https://jenkins.edgexfoundry.org/job/device-mqtt-go-snap-master-stage-snap/ws/> ']'
+ PACKAGES=/tmp/packages_end.txt
+ case "${OS_FAMILY}" in
+ rpm -qa
+ sort
+ '[' -f /tmp/packages_start.txt ']'
+ '[' -f /tmp/packages_end.txt ']'
+ diff /tmp/packages_start.txt /tmp/packages_end.txt
+ '[' <https://jenkins.edgexfoundry.org/job/device-mqtt-go-snap-master-stage-snap/ws/> ']'
+ mkdir -p <https://jenkins.edgexfoundry.org/job/device-mqtt-go-snap-master-stage-snap/ws/archives/>
+ cp -f /tmp/packages_diff.txt /tmp/packages_end.txt /tmp/packages_start.txt <https://jenkins.edgexfoundry.org/job/device-mqtt-go-snap-master-stage-snap/ws/archives/>
provisioning config files...
copy managed file [jenkins-log-archives-settings] to file:<https://jenkins.edgexfoundry.org/job/device-mqtt-go-snap-master-stage-snap/ws/@tmp/config7967609930104411240tmp>
[device-mqtt-go-snap] $ /bin/bash /tmp/jenkins6050408019012887178.sh
---> edgex-infra-ship-logs.sh
Unable to find image 'nexus3.edgexfoundry.org:10003/edgex-lftools-log-publisher:x86_64' locally
x86_64: Pulling from edgex-lftools-log-publisher
e6b0cf9c0882: Pulling fs layer
da0e9bf0cc60: Pulling fs layer
c9ea274ed700: Pulling fs layer
9cfac6ba3733: Pulling fs layer
f6a933c9cadc: Pulling fs layer
61811dbd4963: Pulling fs layer
a6eb2c9e2280: Pulling fs layer
095dd8b7b4d8: Pulling fs layer
dc21a1d4508b: Pulling fs layer
363af2e989c4: Pulling fs layer
9cfac6ba3733: Waiting
f6a933c9cadc: Waiting
a6eb2c9e2280: Waiting
095dd8b7b4d8: Waiting
dc21a1d4508b: Waiting
363af2e989c4: Waiting
61811dbd4963: Waiting
da0e9bf0cc60: Verifying Checksum
da0e9bf0cc60: Download complete
9cfac6ba3733: Verifying Checksum
9cfac6ba3733: Download complete
e6b0cf9c0882: Verifying Checksum
f6a933c9cadc: Verifying Checksum
f6a933c9cadc: Download complete
a6eb2c9e2280: Verifying Checksum
a6eb2c9e2280: Download complete
e6b0cf9c0882: Pull complete
c9ea274ed700: Verifying Checksum
c9ea274ed700: Download complete
da0e9bf0cc60: Pull complete
dc21a1d4508b: Verifying Checksum
dc21a1d4508b: Download complete
363af2e989c4: Verifying Checksum
363af2e989c4: Download complete
095dd8b7b4d8: Verifying Checksum
095dd8b7b4d8: Download complete
61811dbd4963: Verifying Checksum
61811dbd4963: Download complete
c9ea274ed700: Pull complete
9cfac6ba3733: Pull complete
f6a933c9cadc: Pull complete
61811dbd4963: Pull complete
a6eb2c9e2280: Pull complete
095dd8b7b4d8: Pull complete
dc21a1d4508b: Pull complete
363af2e989c4: Pull complete
Digest: sha256:add8188b58b49eaf945790de1a8bc2588125c85e750a42d0a8acc29426f6ed5f
Status: Downloaded newer image for nexus3.edgexfoundry.org:10003/edgex-lftools-log-publisher:x86_64
---> create-netrc.sh
+ ARCHIVE_ARTIFACTS=
+ LOGS_SERVER=https://logs.edgexfoundry.org
+ '[' https://logs.edgexfoundry.org '==' None ]
---> logs-deploy.sh
+ NEXUS_URL=https://nexus.edgexfoundry.org
+ NEXUS_PATH=production/vex-yul-edgex-jenkins-1/device-mqtt-go-snap-master-stage-snap/281
+ BUILD_URL=https://jenkins.edgexfoundry.org/job/device-mqtt-go-snap-master-stage-snap/281/
+ lftools deploy archives -p https://nexus.edgexfoundry.org production/vex-yul-edgex-jenkins-1/device-mqtt-go-snap-master-stage-snap/281 <https://jenkins.edgexfoundry.org/job/device-mqtt-go-snap-master-stage-snap/ws/>
Archives upload complete.
+ lftools deploy logs https://nexus.edgexfoundry.org production/vex-yul-edgex-jenkins-1/device-mqtt-go-snap-master-stage-snap/281 https://jenkins.edgexfoundry.org/job/device-mqtt-go-snap-master-stage-snap/281/
---> uname -a:
Linux 677954cb447d 3.10.0-862.14.4.el7.x86_64 #1 SMP Wed Sep 26 15:12:11 UTC 2018 x86_64 Linux


---> lscpu:
Architecture: x86_64
CPU op-mode(s): 32-bit, 64-bit
Byte Order: Little Endian
Address sizes: 40 bits physical, 48 bits virtual
CPU(s): 4
On-line CPU(s) list: 0-3
Thread(s) per core: 1
Core(s) per socket: 1
Socket(s): 4
NUMA node(s): 1
Vendor ID: GenuineIntel
CPU family: 6
Model: 44
Model name: Westmere E56xx/L56xx/X56xx (IBRS update)
Stepping: 1
CPU MHz: 2933.438
BogoMIPS: 5866.87
Virtualization: VT-x
Hypervisor vendor: KVM
Virtualization type: full
L1d cache: 128 KiB
L1i cache: 128 KiB
L2 cache: 16 MiB
L3 cache: 64 MiB
NUMA node0 CPU(s): 0-3
Vulnerability L1tf: Mitigation; PTE Inversion; VMX SMT disabled, L1D conditional cache flushes
Vulnerability Meltdown: Mitigation; PTI
Vulnerability Spec store bypass: Mitigation; Speculative Store Bypass disabled via prctl and seccomp
Vulnerability Spectre v1: Mitigation; Load fences, __user pointer sanitization
Vulnerability Spectre v2: Mitigation; Full retpoline
Flags: fpu vme de pse tsc msr pae mce cx8 apic sep mtrr pge mca cmov pat pse36 clflush mmx fxsr sse sse2 ss syscall nx pdpe1gb rdtscp lm constant_tsc rep_good nopl xtopology eagerfpu pni pclmulqdq vmx ssse3 cx16 pcid sse4_1 sse4_2 x2apic popcnt tsc_deadline_timer aes hypervisor lahf_lm ssbd ibrs ibpb stibp tpr_shadow vnmi flexpriority ept vpid tsc_adjust arat spec_ctrl intel_stibp


---> nproc:
4


---> df -h:
Filesystem Size Used Available Use% Mounted on
overlay 50.0G 7.1G 42.9G 14% /
tmpfs 64.0M 0 64.0M 0% /dev
tmpfs 919.1M 0 919.1M 0% /sys/fs/cgroup
/dev/vda1 50.0G 7.1G 42.9G 14% /home/jenkins
shm 64.0M 0 64.0M 0% /dev/shm
/dev/vda1 50.0G 7.1G 42.9G 14% /etc/resolv.conf
/dev/vda1 50.0G 7.1G 42.9G 14% /etc/hostname
/dev/vda1 50.0G 7.1G 42.9G 14% /etc/hosts
/dev/vda1 50.0G 7.1G 42.9G 14% /var/log/sa
/dev/vda1 50.0G 7.1G 42.9G 14% <https://jenkins.edgexfoundry.org/job/device-mqtt-go-snap-master-stage-snap/ws/@tmp>
/dev/vda1 50.0G 7.1G 42.9G 14% <https://jenkins.edgexfoundry.org/job/device-mqtt-go-snap-master-stage-snap/ws/>


---> free -m:
total used free shared buff/cache available
Mem: 1838 666 315 0 856 1079
Swap: 1023 4 1019


---> ip addr:
1: lo: <LOOPBACK,UP,LOWER_UP> mtu 65536 qdisc noqueue state UNKNOWN qlen 1000
link/loopback 00:00:00:00:00:00 brd 00:00:00:00:00:00
inet 127.0.0.1/8 scope host lo
valid_lft forever preferred_lft forever
10: eth0@if11: <BROADCAST,MULTICAST,UP,LOWER_UP,M-DOWN> mtu 1458 qdisc noqueue state UP
link/ether 02:42:0a:fa:00:01 brd ff:ff:ff:ff:ff:ff
inet 10.250.0.1/24 brd 10.250.0.255 scope global eth0
valid_lft forever preferred_lft forever


---> sar -b -r -n DEV:
Linux 3.10.0-862.14.4.el7.x86_64 (centos-7-docker-5bc7e375-1660-33dc-fe50-cb0f4dbfa1d5.vexxhost.ne) 02/23/20 _x86_64_ (4 CPU)

09:09:38 LINUX RESTART

09:10:02 tps rtps wtps bread/s bwrtn/s
09:11:01 142.61 52.08 90.53 5898.11 41017.81
09:12:01 189.03 12.84 176.19 1230.73 32516.30
09:13:01 484.90 357.57 127.33 19102.86 22041.62
09:14:01 269.49 120.95 148.54 6408.00 27556.37
09:15:02 146.84 87.43 59.41 1779.88 12199.37
Average: 246.81 126.37 120.44 6881.35 27004.32

09:10:02 kbmemfree kbmemused %memused kbbuffers kbcached kbcommit %commit kbactive kbinact kbdirty
09:11:01 125616 1756688 93.33 2620 1218388 1060112 36.17 423576 1171364 4080
09:12:01 253744 1628560 86.52 2620 976552 1062336 36.25 351496 1005104 81960
09:13:01 68052 1814252 96.38 2476 1135076 1092880 37.29 397444 1138644 41024
09:14:01 77392 1804912 95.89 2208 1115968 1054132 35.97 649432 890376 59500
09:15:02 413552 1468752 78.03 1232 639500 1448076 49.41 594664 575364 1244
Average: 187671 1694633 90.03 2231 1017097 1143507 39.02 483322 956170 37562

09:10:02 IFACE rxpck/s txpck/s rxkB/s txkB/s rxcmp/s txcmp/s rxmcst/s
09:11:01 vethd109a5a 43.61 46.94 3.22 294.37 0.00 0.00 0.00
09:11:01 eth0 302.22 204.25 1339.48 57.98 0.00 0.00 0.00
09:11:01 lo 0.10 0.10 0.01 0.01 0.00 0.00 0.00
09:11:01 docker0 43.61 46.80 2.62 294.36 0.00 0.00 0.00
09:12:01 vethd109a5a 343.55 405.89 23.99 3629.45 0.00 0.00 0.00
09:12:01 eth0 418.37 350.80 3631.73 25.70 0.00 0.00 0.00
09:12:01 lo 0.00 0.00 0.00 0.00 0.00 0.00 0.00
09:12:01 docker0 343.55 405.89 19.29 3629.45 0.00 0.00 0.00
09:13:01 eth0 0.22 0.30 0.04 0.04 0.00 0.00 0.00
09:13:01 lo 0.00 0.00 0.00 0.00 0.00 0.00 0.00
09:13:01 docker0 0.00 0.00 0.00 0.00 0.00 0.00 0.00
09:14:01 eth0 184.75 138.86 2223.02 10.82 0.00 0.00 0.00
09:14:01 lo 0.00 0.00 0.00 0.00 0.00 0.00 0.00
09:14:01 veth51323ab 133.21 177.30 9.48 2221.61 0.00 0.00 0.00
09:14:01 docker0 519.62 629.07 29.53 6140.41 0.00 0.00 0.00
09:15:02 eth0 261.42 181.32 1211.92 16.01 0.00 0.00 0.00
09:15:02 lo 0.00 0.00 0.00 0.00 0.00 0.00 0.00
09:15:02 veth51323ab 177.30 253.90 15.13 1210.84 0.00 0.00 0.00
09:15:02 docker0 177.30 253.90 12.71 1210.84 0.00 0.00 0.00
Average: eth0 227.62 172.97 1674.26 21.79 0.00 0.00 0.00
Average: lo 0.00 0.00 0.00 0.00 0.00 0.00 0.00
Average: veth51323ab 62.43 86.71 4.95 689.39 0.00 0.00 0.00
Average: docker0 139.91 177.28 8.48 1475.09 0.00 0.00 0.00


---> sar -P ALL:
Linux 3.10.0-862.14.4.el7.x86_64 (centos-7-docker-5bc7e375-1660-33dc-fe50-cb0f4dbfa1d5.vexxhost.ne) 02/23/20 _x86_64_ (4 CPU)

09:09:38 LINUX RESTART

09:10:02 CPU %user %nice %system %iowait %steal %idle
09:11:01 all 13.17 0.00 7.59 5.71 18.90 54.63
09:11:01 0 15.32 0.00 7.82 5.19 21.79 49.89
09:11:01 1 10.28 0.00 5.67 5.40 19.16 59.49
09:11:01 2 11.26 0.00 10.71 5.52 17.72 54.79
09:11:01 3 16.08 0.00 6.12 6.73 17.00 54.07
09:12:01 all 10.59 0.00 4.84 0.94 8.23 75.39
09:12:01 0 11.47 0.00 4.68 0.74 10.04 73.06
09:12:01 1 11.71 0.00 4.82 1.12 7.57 74.77
09:12:01 2 12.02 0.00 4.67 1.74 7.71 73.86
09:12:01 3 7.12 0.00 5.21 0.17 7.65 79.84
09:13:01 all 3.58 0.00 3.44 15.05 11.57 66.36
09:13:01 0 3.78 0.00 3.65 15.97 11.99 64.61
09:13:01 1 2.30 0.00 2.79 12.83 11.76 70.32
09:13:01 2 4.36 0.00 2.93 13.46 10.29 68.97
09:13:01 3 3.88 0.00 4.46 18.01 12.28 61.37
09:14:01 all 7.69 0.00 4.72 4.20 7.73 75.66
09:14:01 0 11.65 0.00 4.81 3.19 8.37 71.98
09:14:01 1 3.88 0.00 3.63 3.37 7.24 81.88
09:14:01 2 9.68 0.00 4.99 4.36 7.89 73.08
09:14:01 3 5.53 0.00 5.49 5.90 7.39 75.69
09:15:02 all 26.53 0.00 9.30 1.90 17.78 44.48
09:15:02 0 21.76 0.00 8.41 1.55 18.93 49.35
09:15:02 1 31.65 0.00 10.39 2.29 18.22 37.46
09:15:02 2 27.21 0.00 8.97 1.46 17.75 44.61
09:15:02 3 25.48 0.00 9.42 2.32 16.23 46.54
Average: all 12.13 0.00 5.94 5.66 12.82 63.45
Average: 0 12.66 0.00 5.84 5.45 14.17 61.88
Average: 1 11.67 0.00 5.39 5.09 12.79 65.06
Average: 2 12.71 0.00 6.44 5.40 12.25 63.20
Average: 3 11.47 0.00 6.11 6.73 12.08 63.61


-----END_OF_BUILD-----
Logs upload complete.
+ set +x
Build logs: <a href="https://logs.edgexfoundry.org/production/vex-yul-edgex-jenkins-1/device-mqtt-go-snap-master-stage-snap/281">https://logs.edgexfoundry.org/production/vex-yul-edgex-jenkins-1/device-mqtt-go-snap-master-stage-snap/281</a>
[description-setter] Description set: Build logs: <a href="https://logs.edgexfoundry.org/production/vex-yul-edgex-jenkins-1/device-mqtt-go-snap-master-stage-snap/281">https://logs.edgexfoundry.org/production/vex-yul-edgex-jenkins-1/device-mqtt-go-snap-master-stage-snap/281</a>

Build failed in Jenkins: device-grove-c-snap-master-stage-snap-arm #239 #jenkins

Jenkins <jenkins-donotreply@...>
 

See <https://jenkins.edgexfoundry.org/job/device-grove-c-snap-master-stage-snap-arm/239/display/redirect>

Changes:


------------------------------------------
[...truncated 137.03 KB...]
edgex_device_svcparams params = { GROVE_SVC, NULL, NULL, NULL };
^~~~~~~~~~~~~~~~~~~~~~
edgex_device_stop
In file included from /build/parts/edgex-device-grove/src/src/c/main.c:14:0:
/build/parts/edgex-device-grove/src/src/c/device_grove.h:39:19: warning: initialization makes integer from pointer without a cast [-Wint-conversion]
#define GROVE_SVC "Device-Grove"
^
/build/parts/edgex-device-grove/src/src/c/main.c:725:37: note: in expansion of macro ‘GROVE_SVC’
edgex_device_svcparams params = { GROVE_SVC, NULL, NULL, NULL };
^~~~~~~~~
/build/parts/edgex-device-grove/src/src/c/device_grove.h:39:19: note: (near initialization for ‘params’)
#define GROVE_SVC "Device-Grove"
^
/build/parts/edgex-device-grove/src/src/c/main.c:725:37: note: in expansion of macro ‘GROVE_SVC’
edgex_device_svcparams params = { GROVE_SVC, NULL, NULL, NULL };
^~~~~~~~~
/build/parts/edgex-device-grove/src/src/c/main.c:725:48: warning: excess elements in scalar initializer
edgex_device_svcparams params = { GROVE_SVC, NULL, NULL, NULL };
^~~~
/build/parts/edgex-device-grove/src/src/c/main.c:725:48: note: (near initialization for ‘params’)
/build/parts/edgex-device-grove/src/src/c/main.c:725:54: warning: excess elements in scalar initializer
edgex_device_svcparams params = { GROVE_SVC, NULL, NULL, NULL };
^~~~
/build/parts/edgex-device-grove/src/src/c/main.c:725:54: note: (near initialization for ‘params’)
/build/parts/edgex-device-grove/src/src/c/main.c:725:60: warning: excess elements in scalar initializer
edgex_device_svcparams params = { GROVE_SVC, NULL, NULL, NULL };
^~~~
/build/parts/edgex-device-grove/src/src/c/main.c:725:60: note: (near initialization for ‘params’)
/build/parts/edgex-device-grove/src/src/c/main.c:731:8: warning: implicit declaration of function ‘edgex_device_service_processparams’; did you mean ‘edgex_device_service_start’? [-Wimplicit-function-declaration]
if (!edgex_device_service_processparams (&argc, argv, &params))
^~~~~~~~~~~~~~~~~~~~~~~~~~~~~~~~~~
edgex_device_service_start
/build/parts/edgex-device-grove/src/src/c/main.c:743:7: warning: implicit declaration of function ‘edgex_device_service_usage’; did you mean ‘edgex_device_service_free’? [-Wimplicit-function-declaration]
edgex_device_service_usage ();
^~~~~~~~~~~~~~~~~~~~~~~~~~
edgex_device_service_free
/build/parts/edgex-device-grove/src/src/c/main.c:766:73: error: request for member ‘svcname’ in something not a structure or union
edgex_device_service *grove_service = edgex_device_service_new (params.svcname, GROVE_VERSION, implObject, myImpls, &err);
^
/build/parts/edgex-device-grove/src/src/c/main.c:771:52: error: request for member ‘regURL’ in something not a structure or union
edgex_device_service_start (grove_service, params.regURL, params.profile, params.confdir, &err);
^
/build/parts/edgex-device-grove/src/src/c/main.c:771:67: error: request for member ‘profile’ in something not a structure or union
edgex_device_service_start (grove_service, params.regURL, params.profile, params.confdir, &err);
^
/build/parts/edgex-device-grove/src/src/c/main.c:771:83: error: request for member ‘confdir’ in something not a structure or union
edgex_device_service_start (grove_service, params.regURL, params.profile, params.confdir, &err);
^
make[2]: *** [CMakeFiles/device-grove.dir/main.c.o] Error 1
CMakeFiles/device-grove.dir/build.make:134: recipe for target 'CMakeFiles/device-grove.dir/main.c.o' failed
make[1]: *** [CMakeFiles/device-grove.dir/all] Error 2
CMakeFiles/Makefile2:67: recipe for target 'CMakeFiles/device-grove.dir/all' failed
Makefile:129: recipe for target 'all' failed
make: *** [all] Error 2
cmake /build/parts/edgex-device-grove/src/src/c -DCMAKE_INSTALL_PREFIX= -DCMAKE_BUILD_TYPE=Release
cmake --build . -- -j2
Failed to run 'cmake --build . -- -j2' for 'edgex-device-grove': Exited with code 2.
Verify that the part is using the correct parameters and try again.
Build step 'Execute shell' marked build as failure
$ ssh-agent -k
unset SSH_AUTH_SOCK;
unset SSH_AGENT_PID;
echo Agent pid 1937 killed;
[ssh-agent] Stopped.
[PostBuildScript] - [INFO] Executing post build scripts.
[device-grove-c-snap] $ /bin/bash /tmp/jenkins180310349360562767.sh
---> sysstat.sh
2020-02-23 06:41:17.749905 WARN puppetlabs.facter - could not locate a ruby library: facts requiring Ruby will not be resolved.
2020-02-23 06:41:18.233312 WARN puppetlabs.facter - could not locate a ruby library: facts requiring Ruby will not be resolved.
End of system activity file unexpected
[device-grove-c-snap] $ /bin/bash /tmp/jenkins4037206230288635540.sh
---> package-listing.sh
++ tr '[:upper:]' '[:lower:]'
++ facter osfamily
2020-02-23 06:41:18.852000 WARN puppetlabs.facter - could not locate a ruby library: facts requiring Ruby will not be resolved.
+ OS_FAMILY=debian
+ workspace=<https://jenkins.edgexfoundry.org/job/device-grove-c-snap-master-stage-snap-arm/ws/>
+ START_PACKAGES=/tmp/packages_start.txt
+ END_PACKAGES=/tmp/packages_end.txt
+ DIFF_PACKAGES=/tmp/packages_diff.txt
+ PACKAGES=/tmp/packages_start.txt
+ '[' <https://jenkins.edgexfoundry.org/job/device-grove-c-snap-master-stage-snap-arm/ws/> ']'
+ PACKAGES=/tmp/packages_end.txt
+ case "${OS_FAMILY}" in
+ dpkg -l
+ grep '^ii'
+ '[' -f /tmp/packages_start.txt ']'
+ '[' -f /tmp/packages_end.txt ']'
+ diff /tmp/packages_start.txt /tmp/packages_end.txt
+ '[' <https://jenkins.edgexfoundry.org/job/device-grove-c-snap-master-stage-snap-arm/ws/> ']'
+ mkdir -p <https://jenkins.edgexfoundry.org/job/device-grove-c-snap-master-stage-snap-arm/ws/archives/>
+ cp -f /tmp/packages_diff.txt /tmp/packages_end.txt /tmp/packages_start.txt <https://jenkins.edgexfoundry.org/job/device-grove-c-snap-master-stage-snap-arm/ws/archives/>
provisioning config files...
copy managed file [jenkins-log-archives-settings] to file:<https://jenkins.edgexfoundry.org/job/device-grove-c-snap-master-stage-snap-arm/ws/@tmp/config4928106435937596824tmp>
[device-grove-c-snap] $ /bin/bash /tmp/jenkins4428930974128768650.sh
---> edgex-infra-ship-logs.sh
Unable to find image 'nexus3.edgexfoundry.org:10003/edgex-lftools-log-publisher:aarch64' locally
aarch64: Pulling from edgex-lftools-log-publisher
cde5963f3b93: Pulling fs layer
1cf707181fc0: Pulling fs layer
ecc8062bd8ae: Pulling fs layer
f73053cda371: Pulling fs layer
21891ac9f69c: Pulling fs layer
91256cc9b400: Pulling fs layer
1bd1ff0e301d: Pulling fs layer
55838df30d5e: Pulling fs layer
fe38a35a6fa4: Pulling fs layer
736cb92344f5: Pulling fs layer
1bd1ff0e301d: Waiting
55838df30d5e: Waiting
f73053cda371: Waiting
21891ac9f69c: Waiting
91256cc9b400: Waiting
fe38a35a6fa4: Waiting
736cb92344f5: Waiting
1cf707181fc0: Verifying Checksum
1cf707181fc0: Download complete
f73053cda371: Verifying Checksum
f73053cda371: Download complete
cde5963f3b93: Verifying Checksum
cde5963f3b93: Download complete
21891ac9f69c: Verifying Checksum
21891ac9f69c: Download complete
1bd1ff0e301d: Verifying Checksum
1bd1ff0e301d: Download complete
cde5963f3b93: Pull complete
1cf707181fc0: Pull complete
55838df30d5e: Verifying Checksum
55838df30d5e: Download complete
fe38a35a6fa4: Verifying Checksum
fe38a35a6fa4: Download complete
736cb92344f5: Verifying Checksum
736cb92344f5: Download complete
ecc8062bd8ae: Verifying Checksum
ecc8062bd8ae: Download complete
91256cc9b400: Verifying Checksum
91256cc9b400: Download complete
ecc8062bd8ae: Pull complete
f73053cda371: Pull complete
21891ac9f69c: Pull complete
91256cc9b400: Pull complete
1bd1ff0e301d: Pull complete
55838df30d5e: Pull complete
fe38a35a6fa4: Pull complete
736cb92344f5: Pull complete
Digest: sha256:e038adae1539a751c2d66fc650b1ee2b29832e64e1c88087ccfc4b874f27da29
Status: Downloaded newer image for nexus3.edgexfoundry.org:10003/edgex-lftools-log-publisher:aarch64
---> create-netrc.sh
---> logs-deploy.sh
+ ARCHIVE_ARTIFACTS=
+ LOGS_SERVER=https://logs.edgexfoundry.org
+ '[' https://logs.edgexfoundry.org '==' None ]
+ NEXUS_URL=https://nexus.edgexfoundry.org
+ NEXUS_PATH=production/vex-yul-edgex-jenkins-1/device-grove-c-snap-master-stage-snap-arm/239
+ BUILD_URL=https://jenkins.edgexfoundry.org/job/device-grove-c-snap-master-stage-snap-arm/239/
+ lftools deploy archives -p https://nexus.edgexfoundry.org production/vex-yul-edgex-jenkins-1/device-grove-c-snap-master-stage-snap-arm/239 <https://jenkins.edgexfoundry.org/job/device-grove-c-snap-master-stage-snap-arm/ws/>
Archives upload complete.
+ lftools deploy logs https://nexus.edgexfoundry.org production/vex-yul-edgex-jenkins-1/device-grove-c-snap-master-stage-snap-arm/239 https://jenkins.edgexfoundry.org/job/device-grove-c-snap-master-stage-snap-arm/239/
---> uname -a:
Linux 5ce3986e3482 4.15.0-38-generic #41-Ubuntu SMP Wed Oct 10 10:59:31 UTC 2018 aarch64 Linux


---> lscpu:
Architecture: aarch64
CPU op-mode(s): 64-bit
Byte Order: Little Endian
CPU(s): 2
On-line CPU(s) list: 0,1
Thread(s) per core: 1
Core(s) per socket: 2
Socket(s): 1
NUMA node(s): 1
Vendor ID: Cavium
Model: 1
Model name: ThunderX 88XX
Stepping: 0x1
BogoMIPS: 200.00
NUMA node0 CPU(s): 0,1
Flags: fp asimd evtstrm aes pmull sha1 sha2 crc32 cpuid


---> nproc:
2


---> df -h:
Filesystem Size Used Available Use% Mounted on
overlay 38.6G 6.1G 32.5G 16% /
tmpfs 64.0M 0 64.0M 0% /dev
tmpfs 3.9G 0 3.9G 0% /sys/fs/cgroup
/dev/vda1 38.6G 6.1G 32.5G 16% /home/jenkins
shm 64.0M 0 64.0M 0% /dev/shm
/dev/vda1 38.6G 6.1G 32.5G 16% /etc/resolv.conf
/dev/vda1 38.6G 6.1G 32.5G 16% /etc/hostname
/dev/vda1 38.6G 6.1G 32.5G 16% /etc/hosts
/dev/vda1 38.6G 6.1G 32.5G 16% /var/log/sa
/dev/vda1 38.6G 6.1G 32.5G 16% <https://jenkins.edgexfoundry.org/job/device-grove-c-snap-master-stage-snap-arm/ws/>
/dev/vda1 38.6G 6.1G 32.5G 16% <https://jenkins.edgexfoundry.org/job/device-grove-c-snap-master-stage-snap-arm/ws/@tmp>


---> free -m:
total used free shared buff/cache available
Mem: 7973 644 4509 0 2819 7326
Swap: 1023 0 1023


---> ip addr:
1: lo: <LOOPBACK,UP,LOWER_UP> mtu 65536 qdisc noqueue state UNKNOWN qlen 1000
link/loopback 00:00:00:00:00:00 brd 00:00:00:00:00:00
inet 127.0.0.1/8 scope host lo
valid_lft forever preferred_lft forever
10: eth0@if11: <BROADCAST,MULTICAST,UP,LOWER_UP,M-DOWN> mtu 1458 qdisc noqueue state UP
link/ether 02:42:0a:fa:00:01 brd ff:ff:ff:ff:ff:ff
inet 10.250.0.1/24 brd 10.250.0.255 scope global eth0
valid_lft forever preferred_lft forever


Invalid system activity file: /var/log/sa/sa23
File created by sar/sadc from sysstat version 11.6.1
Current sysstat version cannot read the format of this file (0x2173)
Traceback (most recent call last):
File "/usr/local/bin/lftools", line 8, in <module>
sys.exit(main())
File "/usr/local/lib/python3.8/site-packages/lftools/cli/__init__.py", line 110, in main
cli(obj={})
File "/usr/local/lib/python3.8/site-packages/click/core.py", line 764, in __call__
return self.main(*args, **kwargs)
File "/usr/local/lib/python3.8/site-packages/click/core.py", line 717, in main
rv = self.invoke(ctx)
File "/usr/local/lib/python3.8/site-packages/click/core.py", line 1137, in invoke
return _process_result(sub_ctx.command.invoke(sub_ctx))
File "/usr/local/lib/python3.8/site-packages/click/core.py", line 1137, in invoke
return _process_result(sub_ctx.command.invoke(sub_ctx))
File "/usr/local/lib/python3.8/site-packages/click/core.py", line 956, in invoke
return ctx.invoke(self.callback, **ctx.params)
File "/usr/local/lib/python3.8/site-packages/click/core.py", line 555, in invoke
return callback(*args, **kwargs)
File "/usr/local/lib/python3.8/site-packages/click/decorators.py", line 17, in new_func
return f(get_current_context(), *args, **kwargs)
File "/usr/local/lib/python3.8/site-packages/lftools/cli/deploy.py", line 139, in logs
deploy_sys.deploy_logs(nexus_url, nexus_path, build_url)
File "/usr/local/lib/python3.8/site-packages/lftools/deploy.py", line 293, in deploy_logs
output = subprocess.check_output(c).decode('utf-8')
File "/usr/local/lib/python3.8/subprocess.py", line 411, in check_output
return run(*popenargs, stdout=PIPE, timeout=timeout, check=True,
File "/usr/local/lib/python3.8/subprocess.py", line 512, in run
raise CalledProcessError(retcode, process.args,
subprocess.CalledProcessError: Command '['sar', '-b', '-r', '-n', 'DEV']' returned non-zero exit status 3.
[description-setter] Could not determine description.

Build failed in Jenkins: edgex-ui-go-snap-master-stage-snap-arm #256 #jenkins

Jenkins <jenkins-donotreply@...>
 

See <https://jenkins.edgexfoundry.org/job/edgex-ui-go-snap-master-stage-snap-arm/256/display/redirect>

Changes:


------------------------------------------
[...truncated 65.31 KB...]
readline-common set to automatically installed.
xauth set to automatically installed.
xz-utils set to automatically installed.
The following snaps are required but not installed as snapcraft is running inside docker or podman container: core18.
Please ensure the environment is properly setup before continuing.
Ignore this message if the appropriate measures have already been taken
Pulling go
'edgex-ui-go' has dependencies that need to be staged: go
Skipping pull go (already ran)
Building go
% Total % Received % Xferd Average Speed Time Time Time Current
Dload Upload Total Spent Left Speed
0 0 0 0 0 0 0 0 --:--:-- --:--:-- --:--:-- 0 0 0 0 0 0 0 0 0 --:--:-- --:--:-- --:--:-- 0 41 94.3M 41 38.8M 0 0 38.2M 0 0:00:02 0:00:01 0:00:01 38.2M 99 94.3M 99 93.7M 0 0 46.7M 0 0:00:02 0:00:02 --:--:-- 46.7M100 94.3M 100 94.3M 0 0 46.7M 0 0:00:02 0:00:02 --:--:-- 46.7M
go1.11.9.linux-arm64.tar.gz: OK
Staging go
Pulling edgex-ui-go
Pulling local-snap-assets
Pulling web-static
Skipping build go (already ran)
Building edgex-ui-go
CGO_ENABLED=0 GO111MODULE=on go build -ldflags "-X github.com/edgexfoundry/edgex-ui-go.Version=0.0.0" -o cmd/edgex-ui-server/edgex-ui-server ./cmd/edgex-ui-server
go: finding github.com/BurntSushi/toml v0.3.1
go: finding github.com/eclipse/paho.mqtt.golang v1.2.0
go: finding github.com/gorilla/mux v1.7.1
go: finding github.com/gorilla/websocket v1.4.0
go: finding github.com/kr/pretty v0.1.0
go: finding golang.org/x/net v0.0.0-20190419010253-1f3472d942ba
go: finding gopkg.in/check.v1 v1.0.0-20180628173108-788fd7840127
go: finding gopkg.in/mgo.v2 v2.0.0-20180705113604-9856a29383ce
go: finding github.com/kr/text v0.1.0
go: finding github.com/kr/pty v1.1.1
go: finding golang.org/x/crypto v0.0.0-20190308221718-c2843e01d9a2
go: finding golang.org/x/text v0.3.0
go: finding golang.org/x/sys v0.0.0-20190215142949-d0b11bdaac8a
go: downloading github.com/gorilla/websocket v1.4.0
go: downloading github.com/eclipse/paho.mqtt.golang v1.2.0
go: downloading github.com/gorilla/mux v1.7.1
go: downloading gopkg.in/mgo.v2 v2.0.0-20180705113604-9856a29383ce
go: downloading github.com/BurntSushi/toml v0.3.1
go: downloading golang.org/x/net v0.0.0-20190419010253-1f3472d942ba
CGO_ENABLED=0 GO111MODULE=on go build ./...
Building local-snap-assets
Building web-static
Skipping stage go (already ran)
Staging edgex-ui-go
Staging local-snap-assets
Staging web-static
Priming go
Priming edgex-ui-go
Priming local-snap-assets
Priming web-static
DEPRECATED: The 'version-script' keyword has been deprecated in favour of the 'snapcraftctl set-version' part scriptlet.
See http://snapcraft.io/docs/deprecation-notices/dn10 for more information.
Determining the version from the project repo (version-script).
cat: VERSION: No such file or directory
The version has been set to '-20200223+1b60ac1'
error: cannot validate snap "edgex-ui-go": invalid snap version "-20200223+1b60ac1": must start with an ASCII alphanumeric (and not '-')
Failed to verify directory to pack.
Build step 'Execute shell' marked build as failure
$ ssh-agent -k
unset SSH_AUTH_SOCK;
unset SSH_AGENT_PID;
echo Agent pid 1951 killed;
[ssh-agent] Stopped.
[PostBuildScript] - [INFO] Executing post build scripts.
[edgex-ui-go-snap] $ /bin/bash /tmp/jenkins1540772604185296022.sh
---> sysstat.sh
2020-02-23 06:17:41.127756 WARN puppetlabs.facter - could not locate a ruby library: facts requiring Ruby will not be resolved.
2020-02-23 06:17:41.531082 WARN puppetlabs.facter - could not locate a ruby library: facts requiring Ruby will not be resolved.
End of system activity file unexpected
[edgex-ui-go-snap] $ /bin/bash /tmp/jenkins8915168828825724384.sh
---> package-listing.sh
++ facter osfamily
++ tr '[:upper:]' '[:lower:]'
2020-02-23 06:17:42.096819 WARN puppetlabs.facter - could not locate a ruby library: facts requiring Ruby will not be resolved.
+ OS_FAMILY=debian
+ workspace=<https://jenkins.edgexfoundry.org/job/edgex-ui-go-snap-master-stage-snap-arm/ws/>
+ START_PACKAGES=/tmp/packages_start.txt
+ END_PACKAGES=/tmp/packages_end.txt
+ DIFF_PACKAGES=/tmp/packages_diff.txt
+ PACKAGES=/tmp/packages_start.txt
+ '[' <https://jenkins.edgexfoundry.org/job/edgex-ui-go-snap-master-stage-snap-arm/ws/> ']'
+ PACKAGES=/tmp/packages_end.txt
+ case "${OS_FAMILY}" in
+ grep '^ii'
+ dpkg -l
+ '[' -f /tmp/packages_start.txt ']'
+ '[' -f /tmp/packages_end.txt ']'
+ diff /tmp/packages_start.txt /tmp/packages_end.txt
+ '[' <https://jenkins.edgexfoundry.org/job/edgex-ui-go-snap-master-stage-snap-arm/ws/> ']'
+ mkdir -p <https://jenkins.edgexfoundry.org/job/edgex-ui-go-snap-master-stage-snap-arm/ws/archives/>
+ cp -f /tmp/packages_diff.txt /tmp/packages_end.txt /tmp/packages_start.txt <https://jenkins.edgexfoundry.org/job/edgex-ui-go-snap-master-stage-snap-arm/ws/archives/>
provisioning config files...
copy managed file [jenkins-log-archives-settings] to file:<https://jenkins.edgexfoundry.org/job/edgex-ui-go-snap-master-stage-snap-arm/ws/@tmp/config3723164274173527017tmp>
[edgex-ui-go-snap] $ /bin/bash /tmp/jenkins7181437180219986800.sh
---> edgex-infra-ship-logs.sh
Unable to find image 'nexus3.edgexfoundry.org:10003/edgex-lftools-log-publisher:aarch64' locally
aarch64: Pulling from edgex-lftools-log-publisher
cde5963f3b93: Pulling fs layer
1cf707181fc0: Pulling fs layer
ecc8062bd8ae: Pulling fs layer
f73053cda371: Pulling fs layer
21891ac9f69c: Pulling fs layer
91256cc9b400: Pulling fs layer
1bd1ff0e301d: Pulling fs layer
55838df30d5e: Pulling fs layer
fe38a35a6fa4: Pulling fs layer
736cb92344f5: Pulling fs layer
f73053cda371: Waiting
21891ac9f69c: Waiting
91256cc9b400: Waiting
1bd1ff0e301d: Waiting
55838df30d5e: Waiting
fe38a35a6fa4: Waiting
736cb92344f5: Waiting
1cf707181fc0: Verifying Checksum
1cf707181fc0: Download complete
f73053cda371: Verifying Checksum
f73053cda371: Download complete
cde5963f3b93: Verifying Checksum
cde5963f3b93: Download complete
21891ac9f69c: Verifying Checksum
21891ac9f69c: Download complete
1bd1ff0e301d: Verifying Checksum
1bd1ff0e301d: Download complete
cde5963f3b93: Pull complete
1cf707181fc0: Pull complete
55838df30d5e: Verifying Checksum
55838df30d5e: Download complete
fe38a35a6fa4: Verifying Checksum
fe38a35a6fa4: Download complete
736cb92344f5: Verifying Checksum
736cb92344f5: Download complete
ecc8062bd8ae: Verifying Checksum
ecc8062bd8ae: Download complete
91256cc9b400: Verifying Checksum
91256cc9b400: Download complete
ecc8062bd8ae: Pull complete
f73053cda371: Pull complete
21891ac9f69c: Pull complete
91256cc9b400: Pull complete
1bd1ff0e301d: Pull complete
55838df30d5e: Pull complete
fe38a35a6fa4: Pull complete
736cb92344f5: Pull complete
Digest: sha256:e038adae1539a751c2d66fc650b1ee2b29832e64e1c88087ccfc4b874f27da29
Status: Downloaded newer image for nexus3.edgexfoundry.org:10003/edgex-lftools-log-publisher:aarch64
---> create-netrc.sh
---> logs-deploy.sh
+ ARCHIVE_ARTIFACTS=
+ LOGS_SERVER=https://logs.edgexfoundry.org
+ '[' https://logs.edgexfoundry.org '==' None ]
+ NEXUS_URL=https://nexus.edgexfoundry.org
+ NEXUS_PATH=production/vex-yul-edgex-jenkins-1/edgex-ui-go-snap-master-stage-snap-arm/256
+ BUILD_URL=https://jenkins.edgexfoundry.org/job/edgex-ui-go-snap-master-stage-snap-arm/256/
+ lftools deploy archives -p https://nexus.edgexfoundry.org production/vex-yul-edgex-jenkins-1/edgex-ui-go-snap-master-stage-snap-arm/256 <https://jenkins.edgexfoundry.org/job/edgex-ui-go-snap-master-stage-snap-arm/ws/>
Archives upload complete.
+ lftools deploy logs https://nexus.edgexfoundry.org production/vex-yul-edgex-jenkins-1/edgex-ui-go-snap-master-stage-snap-arm/256 https://jenkins.edgexfoundry.org/job/edgex-ui-go-snap-master-stage-snap-arm/256/
---> uname -a:
Linux a2b1a9a9128c 4.15.0-38-generic #41-Ubuntu SMP Wed Oct 10 10:59:31 UTC 2018 aarch64 Linux


---> lscpu:
Architecture: aarch64
CPU op-mode(s): 64-bit
Byte Order: Little Endian
CPU(s): 2
On-line CPU(s) list: 0,1
Thread(s) per core: 1
Core(s) per socket: 2
Socket(s): 1
NUMA node(s): 1
Vendor ID: Cavium
Model: 1
Model name: ThunderX 88XX
Stepping: 0x1
BogoMIPS: 200.00
NUMA node0 CPU(s): 0,1
Flags: fp asimd evtstrm aes pmull sha1 sha2 crc32 cpuid


---> nproc:
2


---> df -h:
Filesystem Size Used Available Use% Mounted on
overlay 38.6G 6.1G 32.5G 16% /
tmpfs 64.0M 0 64.0M 0% /dev
tmpfs 3.9G 0 3.9G 0% /sys/fs/cgroup
/dev/vda1 38.6G 6.1G 32.5G 16% /home/jenkins
shm 64.0M 0 64.0M 0% /dev/shm
/dev/vda1 38.6G 6.1G 32.5G 16% /etc/resolv.conf
/dev/vda1 38.6G 6.1G 32.5G 16% /etc/hostname
/dev/vda1 38.6G 6.1G 32.5G 16% /etc/hosts
/dev/vda1 38.6G 6.1G 32.5G 16% /var/log/sa
/dev/vda1 38.6G 6.1G 32.5G 16% <https://jenkins.edgexfoundry.org/job/edgex-ui-go-snap-master-stage-snap-arm/ws/>
/dev/vda1 38.6G 6.1G 32.5G 16% <https://jenkins.edgexfoundry.org/job/edgex-ui-go-snap-master-stage-snap-arm/ws/@tmp>


---> free -m:
total used free shared buff/cache available
Mem: 7973 636 4504 0 2833 7332
Swap: 1023 0 1023


---> ip addr:
1: lo: <LOOPBACK,UP,LOWER_UP> mtu 65536 qdisc noqueue state UNKNOWN qlen 1000
link/loopback 00:00:00:00:00:00 brd 00:00:00:00:00:00
inet 127.0.0.1/8 scope host lo
valid_lft forever preferred_lft forever
10: eth0@if11: <BROADCAST,MULTICAST,UP,LOWER_UP,M-DOWN> mtu 1458 qdisc noqueue state UP
link/ether 02:42:0a:fa:00:01 brd ff:ff:ff:ff:ff:ff
inet 10.250.0.1/24 brd 10.250.0.255 scope global eth0
valid_lft forever preferred_lft forever


Invalid system activity file: /var/log/sa/sa23
File created by sar/sadc from sysstat version 11.6.1
Current sysstat version cannot read the format of this file (0x2173)
Traceback (most recent call last):
File "/usr/local/bin/lftools", line 8, in <module>
sys.exit(main())
File "/usr/local/lib/python3.8/site-packages/lftools/cli/__init__.py", line 110, in main
cli(obj={})
File "/usr/local/lib/python3.8/site-packages/click/core.py", line 764, in __call__
return self.main(*args, **kwargs)
File "/usr/local/lib/python3.8/site-packages/click/core.py", line 717, in main
rv = self.invoke(ctx)
File "/usr/local/lib/python3.8/site-packages/click/core.py", line 1137, in invoke
return _process_result(sub_ctx.command.invoke(sub_ctx))
File "/usr/local/lib/python3.8/site-packages/click/core.py", line 1137, in invoke
return _process_result(sub_ctx.command.invoke(sub_ctx))
File "/usr/local/lib/python3.8/site-packages/click/core.py", line 956, in invoke
return ctx.invoke(self.callback, **ctx.params)
File "/usr/local/lib/python3.8/site-packages/click/core.py", line 555, in invoke
return callback(*args, **kwargs)
File "/usr/local/lib/python3.8/site-packages/click/decorators.py", line 17, in new_func
return f(get_current_context(), *args, **kwargs)
File "/usr/local/lib/python3.8/site-packages/lftools/cli/deploy.py", line 139, in logs
deploy_sys.deploy_logs(nexus_url, nexus_path, build_url)
File "/usr/local/lib/python3.8/site-packages/lftools/deploy.py", line 293, in deploy_logs
output = subprocess.check_output(c).decode('utf-8')
File "/usr/local/lib/python3.8/subprocess.py", line 411, in check_output
return run(*popenargs, stdout=PIPE, timeout=timeout, check=True,
File "/usr/local/lib/python3.8/subprocess.py", line 512, in run
raise CalledProcessError(retcode, process.args,
subprocess.CalledProcessError: Command '['sar', '-b', '-r', '-n', 'DEV']' returned non-zero exit status 3.
[description-setter] Could not determine description.

Build failed in Jenkins: device-modbus-go-snap-master-stage-snap-arm #281 #jenkins

Jenkins <jenkins-donotreply@...>
 

See <https://jenkins.edgexfoundry.org/job/device-modbus-go-snap-master-stage-snap-arm/281/display/redirect>

Changes:


------------------------------------------
[...truncated 44.08 KB...]
go: finding github.com/hashicorp/mdns v1.0.0
go: finding github.com/hashicorp/go-msgpack v0.5.3
go: finding github.com/hashicorp/memberlist v0.1.3
go: finding github.com/mitchellh/iochan v1.0.0
go: finding github.com/mitchellh/consulstructure v0.0.0-20190329231841-56fdc4d2da54
go: finding golang.org/x/sys v0.0.0-20181026203630-95b1ffbd15a5
go: finding github.com/miekg/dns v1.0.14
go: finding golang.org/x/sync v0.0.0-20181221193216-37e7f081c4d4
go: finding golang.org/x/crypto v0.0.0-20181029021203-45a5f77698d3
go: finding golang.org/x/net v0.0.0-20181023162649-9b4f9f5ad519
go: finding github.com/hashicorp/go.net v0.0.1
go: finding github.com/davecgh/go-spew v1.1.1
go: finding github.com/hashicorp/go-sockaddr v1.0.0
go: finding github.com/stretchr/testify v1.2.2
go: finding github.com/google/btree v0.0.0-20180813153112-4030bb1f1f0c
go: finding github.com/sean-/seed v0.0.0-20170313163322-e2103e2c3529
go: finding github.com/hashicorp/go-immutable-radix v1.0.0
go: finding github.com/pascaldekloe/goe v0.0.0-20180627143212-57f6aae5913c
go: finding github.com/hashicorp/go-uuid v1.0.0
go: finding github.com/hashicorp/golang-lru v0.5.0
go: downloading github.com/edgexfoundry/device-sdk-go v0.0.0-20191023171807-49a95f741ef7
go: downloading github.com/goburrow/modbus v0.1.0
go: downloading github.com/edgexfoundry/go-mod-core-contracts v0.1.31
go: downloading github.com/goburrow/serial v0.1.0
go: downloading github.com/ugorji/go v1.1.4
go: downloading github.com/google/uuid v1.1.1
go: downloading github.com/pelletier/go-toml v1.2.0
go: downloading github.com/pkg/errors v0.8.1
go: downloading github.com/edgexfoundry/go-mod-registry v0.1.0
go: downloading gopkg.in/yaml.v2 v2.2.2
go: downloading github.com/gorilla/mux v1.7.0
go: downloading github.com/go-kit/kit v0.8.0
go: downloading github.com/mitchellh/consulstructure v0.0.0-20190329231841-56fdc4d2da54
go: downloading github.com/hashicorp/consul v1.4.2
go: downloading github.com/mitchellh/copystructure v1.0.0
go: downloading github.com/cenkalti/backoff v2.1.1+incompatible
go: downloading github.com/mitchellh/mapstructure v1.1.2
go: downloading github.com/mitchellh/reflectwalk v1.0.0
go: downloading github.com/go-logfmt/logfmt v0.4.0
go: downloading github.com/hashicorp/serf v0.8.2
go: downloading github.com/hashicorp/go-rootcerts v1.0.0
go: downloading github.com/hashicorp/go-cleanhttp v0.5.0
go: downloading github.com/armon/go-metrics v0.0.0-20180917152333-f0300d1749da
go: downloading github.com/hashicorp/go-immutable-radix v1.0.0
go: downloading github.com/hashicorp/golang-lru v0.5.1
CGO_ENABLED=0 GO111MODULE=on go build ./...
go: downloading github.com/tbrandon/mbserver v0.0.0-20170611213546-993e1772cc62
Skipping stage go (already ran)
Staging device-modbus
Priming go
Priming device-modbus
DEPRECATED: The 'version-script' keyword has been deprecated in favour of the 'snapcraftctl set-version' part scriptlet.
See http://snapcraft.io/docs/deprecation-notices/dn10 for more information.
Determining the version from the project repo (version-script).
cat: VERSION: No such file or directory
The version has been set to '-20200223+f8002f6'
error: cannot validate snap "edgex-device-modbus": invalid snap version "-20200223+f8002f6": must start with an ASCII alphanumeric (and not '-')
Failed to verify directory to pack.
Build step 'Execute shell' marked build as failure
$ ssh-agent -k
unset SSH_AUTH_SOCK;
unset SSH_AGENT_PID;
echo Agent pid 1981 killed;
[ssh-agent] Stopped.
[PostBuildScript] - [INFO] Executing post build scripts.
[device-modbus-go-snap] $ /bin/bash /tmp/jenkins5461032246866640244.sh
---> sysstat.sh
2020-02-23 04:51:28.624098 WARN puppetlabs.facter - could not locate a ruby library: facts requiring Ruby will not be resolved.
2020-02-23 04:51:29.081688 WARN puppetlabs.facter - could not locate a ruby library: facts requiring Ruby will not be resolved.
End of system activity file unexpected
[device-modbus-go-snap] $ /bin/bash /tmp/jenkins1443344043080124446.sh
---> package-listing.sh
++ facter osfamily
++ tr '[:upper:]' '[:lower:]'
2020-02-23 04:51:29.619234 WARN puppetlabs.facter - could not locate a ruby library: facts requiring Ruby will not be resolved.
+ OS_FAMILY=debian
+ workspace=<https://jenkins.edgexfoundry.org/job/device-modbus-go-snap-master-stage-snap-arm/ws/>
+ START_PACKAGES=/tmp/packages_start.txt
+ END_PACKAGES=/tmp/packages_end.txt
+ DIFF_PACKAGES=/tmp/packages_diff.txt
+ PACKAGES=/tmp/packages_start.txt
+ '[' <https://jenkins.edgexfoundry.org/job/device-modbus-go-snap-master-stage-snap-arm/ws/> ']'
+ PACKAGES=/tmp/packages_end.txt
+ case "${OS_FAMILY}" in
+ dpkg -l
+ grep '^ii'
+ '[' -f /tmp/packages_start.txt ']'
+ '[' -f /tmp/packages_end.txt ']'
+ diff /tmp/packages_start.txt /tmp/packages_end.txt
+ '[' <https://jenkins.edgexfoundry.org/job/device-modbus-go-snap-master-stage-snap-arm/ws/> ']'
+ mkdir -p <https://jenkins.edgexfoundry.org/job/device-modbus-go-snap-master-stage-snap-arm/ws/archives/>
+ cp -f /tmp/packages_diff.txt /tmp/packages_end.txt /tmp/packages_start.txt <https://jenkins.edgexfoundry.org/job/device-modbus-go-snap-master-stage-snap-arm/ws/archives/>
provisioning config files...
copy managed file [jenkins-log-archives-settings] to file:<https://jenkins.edgexfoundry.org/job/device-modbus-go-snap-master-stage-snap-arm/ws/@tmp/config4433203278761746985tmp>
[device-modbus-go-snap] $ /bin/bash /tmp/jenkins4789749173591715389.sh
---> edgex-infra-ship-logs.sh
Unable to find image 'nexus3.edgexfoundry.org:10003/edgex-lftools-log-publisher:aarch64' locally
aarch64: Pulling from edgex-lftools-log-publisher
cde5963f3b93: Pulling fs layer
1cf707181fc0: Pulling fs layer
ecc8062bd8ae: Pulling fs layer
f73053cda371: Pulling fs layer
21891ac9f69c: Pulling fs layer
91256cc9b400: Pulling fs layer
1bd1ff0e301d: Pulling fs layer
55838df30d5e: Pulling fs layer
fe38a35a6fa4: Pulling fs layer
736cb92344f5: Pulling fs layer
f73053cda371: Waiting
21891ac9f69c: Waiting
91256cc9b400: Waiting
1bd1ff0e301d: Waiting
55838df30d5e: Waiting
fe38a35a6fa4: Waiting
736cb92344f5: Waiting
1cf707181fc0: Verifying Checksum
1cf707181fc0: Download complete
f73053cda371: Verifying Checksum
f73053cda371: Download complete
cde5963f3b93: Verifying Checksum
cde5963f3b93: Download complete
21891ac9f69c: Verifying Checksum
21891ac9f69c: Download complete
1bd1ff0e301d: Verifying Checksum
1bd1ff0e301d: Download complete
cde5963f3b93: Pull complete
1cf707181fc0: Pull complete
55838df30d5e: Verifying Checksum
55838df30d5e: Download complete
fe38a35a6fa4: Verifying Checksum
fe38a35a6fa4: Download complete
736cb92344f5: Verifying Checksum
736cb92344f5: Download complete
ecc8062bd8ae: Verifying Checksum
ecc8062bd8ae: Download complete
91256cc9b400: Verifying Checksum
91256cc9b400: Download complete
ecc8062bd8ae: Pull complete
f73053cda371: Pull complete
21891ac9f69c: Pull complete
91256cc9b400: Pull complete
1bd1ff0e301d: Pull complete
55838df30d5e: Pull complete
fe38a35a6fa4: Pull complete
736cb92344f5: Pull complete
Digest: sha256:e038adae1539a751c2d66fc650b1ee2b29832e64e1c88087ccfc4b874f27da29
Status: Downloaded newer image for nexus3.edgexfoundry.org:10003/edgex-lftools-log-publisher:aarch64
---> create-netrc.sh
+ ARCHIVE_ARTIFACTS=
+ LOGS_SERVER=https://logs.edgexfoundry.org
+ '[' https://logs.edgexfoundry.org '==' None ]
+ NEXUS_URL=https://nexus.edgexfoundry.org
+ NEXUS_PATH=production/vex-yul-edgex-jenkins-1/device-modbus-go-snap-master-stage-snap-arm/281
+ BUILD_URL=https://jenkins.edgexfoundry.org/job/device-modbus-go-snap-master-stage-snap-arm/281/
+ lftools deploy archives -p https://nexus.edgexfoundry.org production/vex-yul-edgex-jenkins-1/device-modbus-go-snap-master-stage-snap-arm/281 <https://jenkins.edgexfoundry.org/job/device-modbus-go-snap-master-stage-snap-arm/ws/>
---> logs-deploy.sh
Archives upload complete.
+ lftools deploy logs https://nexus.edgexfoundry.org production/vex-yul-edgex-jenkins-1/device-modbus-go-snap-master-stage-snap-arm/281 https://jenkins.edgexfoundry.org/job/device-modbus-go-snap-master-stage-snap-arm/281/
---> uname -a:
Linux 9e9c5087b2f0 4.15.0-38-generic #41-Ubuntu SMP Wed Oct 10 10:59:31 UTC 2018 aarch64 Linux


---> lscpu:
Architecture: aarch64
CPU op-mode(s): 64-bit
Byte Order: Little Endian
CPU(s): 2
On-line CPU(s) list: 0,1
Thread(s) per core: 1
Core(s) per socket: 2
Socket(s): 1
NUMA node(s): 1
Vendor ID: Cavium
Model: 1
Model name: ThunderX 88XX
Stepping: 0x1
BogoMIPS: 200.00
NUMA node0 CPU(s): 0,1
Flags: fp asimd evtstrm aes pmull sha1 sha2 crc32 cpuid


---> nproc:
2


---> df -h:
Filesystem Size Used Available Use% Mounted on
overlay 38.6G 6.1G 32.5G 16% /
tmpfs 64.0M 0 64.0M 0% /dev
tmpfs 3.9G 0 3.9G 0% /sys/fs/cgroup
/dev/vda1 38.6G 6.1G 32.5G 16% /home/jenkins
shm 64.0M 0 64.0M 0% /dev/shm
/dev/vda1 38.6G 6.1G 32.5G 16% /etc/resolv.conf
/dev/vda1 38.6G 6.1G 32.5G 16% /etc/hostname
/dev/vda1 38.6G 6.1G 32.5G 16% /etc/hosts
/dev/vda1 38.6G 6.1G 32.5G 16% /var/log/sa
/dev/vda1 38.6G 6.1G 32.5G 16% <https://jenkins.edgexfoundry.org/job/device-modbus-go-snap-master-stage-snap-arm/ws/>
/dev/vda1 38.6G 6.1G 32.5G 16% <https://jenkins.edgexfoundry.org/job/device-modbus-go-snap-master-stage-snap-arm/ws/@tmp>


---> free -m:
total used free shared buff/cache available
Mem: 7973 645 4513 0 2814 7316
Swap: 1023 0 1023


---> ip addr:
1: lo: <LOOPBACK,UP,LOWER_UP> mtu 65536 qdisc noqueue state UNKNOWN qlen 1000
link/loopback 00:00:00:00:00:00 brd 00:00:00:00:00:00
inet 127.0.0.1/8 scope host lo
valid_lft forever preferred_lft forever
10: eth0@if11: <BROADCAST,MULTICAST,UP,LOWER_UP,M-DOWN> mtu 1458 qdisc noqueue state UP
link/ether 02:42:0a:fa:00:01 brd ff:ff:ff:ff:ff:ff
inet 10.250.0.1/24 brd 10.250.0.255 scope global eth0
valid_lft forever preferred_lft forever


Invalid system activity file: /var/log/sa/sa23
File created by sar/sadc from sysstat version 11.6.1
Current sysstat version cannot read the format of this file (0x2173)
Traceback (most recent call last):
File "/usr/local/bin/lftools", line 8, in <module>
sys.exit(main())
File "/usr/local/lib/python3.8/site-packages/lftools/cli/__init__.py", line 110, in main
cli(obj={})
File "/usr/local/lib/python3.8/site-packages/click/core.py", line 764, in __call__
return self.main(*args, **kwargs)
File "/usr/local/lib/python3.8/site-packages/click/core.py", line 717, in main
rv = self.invoke(ctx)
File "/usr/local/lib/python3.8/site-packages/click/core.py", line 1137, in invoke
return _process_result(sub_ctx.command.invoke(sub_ctx))
File "/usr/local/lib/python3.8/site-packages/click/core.py", line 1137, in invoke
return _process_result(sub_ctx.command.invoke(sub_ctx))
File "/usr/local/lib/python3.8/site-packages/click/core.py", line 956, in invoke
return ctx.invoke(self.callback, **ctx.params)
File "/usr/local/lib/python3.8/site-packages/click/core.py", line 555, in invoke
return callback(*args, **kwargs)
File "/usr/local/lib/python3.8/site-packages/click/decorators.py", line 17, in new_func
return f(get_current_context(), *args, **kwargs)
File "/usr/local/lib/python3.8/site-packages/lftools/cli/deploy.py", line 139, in logs
deploy_sys.deploy_logs(nexus_url, nexus_path, build_url)
File "/usr/local/lib/python3.8/site-packages/lftools/deploy.py", line 293, in deploy_logs
output = subprocess.check_output(c).decode('utf-8')
File "/usr/local/lib/python3.8/subprocess.py", line 411, in check_output
return run(*popenargs, stdout=PIPE, timeout=timeout, check=True,
File "/usr/local/lib/python3.8/subprocess.py", line 512, in run
raise CalledProcessError(retcode, process.args,
subprocess.CalledProcessError: Command '['sar', '-b', '-r', '-n', 'DEV']' returned non-zero exit status 3.
[description-setter] Could not determine description.

Build failed in Jenkins: device-grove-c-snap-fuji-stage-snap #101 #jenkins

Jenkins <jenkins-donotreply@...>
 

See <https://jenkins.edgexfoundry.org/job/device-grove-c-snap-fuji-stage-snap/101/display/redirect>

Changes:


------------------------------------------
[...truncated 141.87 KB...]
---> sysstat.sh
[device-grove-c-snap] $ /bin/bash /tmp/jenkins6824617665647882806.sh
---> package-listing.sh
++ facter osfamily
++ tr '[:upper:]' '[:lower:]'
+ OS_FAMILY=redhat
+ workspace=<https://jenkins.edgexfoundry.org/job/device-grove-c-snap-fuji-stage-snap/ws/>
+ START_PACKAGES=/tmp/packages_start.txt
+ END_PACKAGES=/tmp/packages_end.txt
+ DIFF_PACKAGES=/tmp/packages_diff.txt
+ PACKAGES=/tmp/packages_start.txt
+ '[' <https://jenkins.edgexfoundry.org/job/device-grove-c-snap-fuji-stage-snap/ws/> ']'
+ PACKAGES=/tmp/packages_end.txt
+ case "${OS_FAMILY}" in
+ rpm -qa
+ sort
+ '[' -f /tmp/packages_start.txt ']'
+ '[' -f /tmp/packages_end.txt ']'
+ diff /tmp/packages_start.txt /tmp/packages_end.txt
+ '[' <https://jenkins.edgexfoundry.org/job/device-grove-c-snap-fuji-stage-snap/ws/> ']'
+ mkdir -p <https://jenkins.edgexfoundry.org/job/device-grove-c-snap-fuji-stage-snap/ws/archives/>
+ cp -f /tmp/packages_diff.txt /tmp/packages_end.txt /tmp/packages_start.txt <https://jenkins.edgexfoundry.org/job/device-grove-c-snap-fuji-stage-snap/ws/archives/>
provisioning config files...
copy managed file [jenkins-log-archives-settings] to file:<https://jenkins.edgexfoundry.org/job/device-grove-c-snap-fuji-stage-snap/ws/@tmp/config4934247530914271624tmp>
[device-grove-c-snap] $ /bin/bash /tmp/jenkins2864250328657320665.sh
---> edgex-infra-ship-logs.sh
Unable to find image 'nexus3.edgexfoundry.org:10003/edgex-lftools-log-publisher:x86_64' locally
x86_64: Pulling from edgex-lftools-log-publisher
e6b0cf9c0882: Pulling fs layer
da0e9bf0cc60: Pulling fs layer
c9ea274ed700: Pulling fs layer
9cfac6ba3733: Pulling fs layer
f6a933c9cadc: Pulling fs layer
61811dbd4963: Pulling fs layer
a6eb2c9e2280: Pulling fs layer
095dd8b7b4d8: Pulling fs layer
dc21a1d4508b: Pulling fs layer
363af2e989c4: Pulling fs layer
9cfac6ba3733: Waiting
a6eb2c9e2280: Waiting
dc21a1d4508b: Waiting
363af2e989c4: Waiting
095dd8b7b4d8: Waiting
f6a933c9cadc: Waiting
61811dbd4963: Waiting
da0e9bf0cc60: Verifying Checksum
da0e9bf0cc60: Download complete
9cfac6ba3733: Verifying Checksum
9cfac6ba3733: Download complete
e6b0cf9c0882: Verifying Checksum
f6a933c9cadc: Verifying Checksum
f6a933c9cadc: Download complete
a6eb2c9e2280: Verifying Checksum
a6eb2c9e2280: Download complete
e6b0cf9c0882: Pull complete
095dd8b7b4d8: Verifying Checksum
095dd8b7b4d8: Download complete
da0e9bf0cc60: Pull complete
dc21a1d4508b: Verifying Checksum
dc21a1d4508b: Download complete
c9ea274ed700: Verifying Checksum
c9ea274ed700: Download complete
363af2e989c4: Verifying Checksum
363af2e989c4: Download complete
61811dbd4963: Verifying Checksum
61811dbd4963: Download complete
c9ea274ed700: Pull complete
9cfac6ba3733: Pull complete
f6a933c9cadc: Pull complete
61811dbd4963: Pull complete
a6eb2c9e2280: Pull complete
095dd8b7b4d8: Pull complete
dc21a1d4508b: Pull complete
363af2e989c4: Pull complete
Digest: sha256:add8188b58b49eaf945790de1a8bc2588125c85e750a42d0a8acc29426f6ed5f
Status: Downloaded newer image for nexus3.edgexfoundry.org:10003/edgex-lftools-log-publisher:x86_64
---> create-netrc.sh
+ ARCHIVE_ARTIFACTS=
+ LOGS_SERVER=https://logs.edgexfoundry.org
+ '[' https://logs.edgexfoundry.org '==' None ]
---> logs-deploy.sh
+ NEXUS_URL=https://nexus.edgexfoundry.org
+ NEXUS_PATH=production/vex-yul-edgex-jenkins-1/device-grove-c-snap-fuji-stage-snap/101
+ BUILD_URL=https://jenkins.edgexfoundry.org/job/device-grove-c-snap-fuji-stage-snap/101/
+ lftools deploy archives -p https://nexus.edgexfoundry.org production/vex-yul-edgex-jenkins-1/device-grove-c-snap-fuji-stage-snap/101 <https://jenkins.edgexfoundry.org/job/device-grove-c-snap-fuji-stage-snap/ws/>
Archives upload complete.
+ lftools deploy logs https://nexus.edgexfoundry.org production/vex-yul-edgex-jenkins-1/device-grove-c-snap-fuji-stage-snap/101 https://jenkins.edgexfoundry.org/job/device-grove-c-snap-fuji-stage-snap/101/
---> uname -a:
Linux bba8f31e39b0 3.10.0-862.14.4.el7.x86_64 #1 SMP Wed Sep 26 15:12:11 UTC 2018 x86_64 Linux


---> lscpu:
Architecture: x86_64
CPU op-mode(s): 32-bit, 64-bit
Byte Order: Little Endian
Address sizes: 40 bits physical, 48 bits virtual
CPU(s): 4
On-line CPU(s) list: 0-3
Thread(s) per core: 1
Core(s) per socket: 1
Socket(s): 4
NUMA node(s): 1
Vendor ID: GenuineIntel
CPU family: 6
Model: 44
Model name: Westmere E56xx/L56xx/X56xx (IBRS update)
Stepping: 1
CPU MHz: 2933.396
BogoMIPS: 5866.79
Virtualization: VT-x
Hypervisor vendor: KVM
Virtualization type: full
L1d cache: 128 KiB
L1i cache: 128 KiB
L2 cache: 16 MiB
L3 cache: 64 MiB
NUMA node0 CPU(s): 0-3
Vulnerability L1tf: Mitigation; PTE Inversion; VMX SMT disabled, L1D conditional cache flushes
Vulnerability Meltdown: Mitigation; PTI
Vulnerability Spec store bypass: Mitigation; Speculative Store Bypass disabled via prctl and seccomp
Vulnerability Spectre v1: Mitigation; Load fences, __user pointer sanitization
Vulnerability Spectre v2: Mitigation; Full retpoline
Flags: fpu vme de pse tsc msr pae mce cx8 apic sep mtrr pge mca cmov pat pse36 clflush mmx fxsr sse sse2 ss syscall nx pdpe1gb rdtscp lm constant_tsc rep_good nopl xtopology eagerfpu pni pclmulqdq vmx ssse3 cx16 pcid sse4_1 sse4_2 x2apic popcnt tsc_deadline_timer aes hypervisor lahf_lm ssbd ibrs ibpb stibp tpr_shadow vnmi flexpriority ept vpid tsc_adjust arat spec_ctrl intel_stibp


---> nproc:
4


---> df -h:
Filesystem Size Used Available Use% Mounted on
overlay 50.0G 7.1G 42.9G 14% /
tmpfs 64.0M 0 64.0M 0% /dev
tmpfs 919.1M 0 919.1M 0% /sys/fs/cgroup
/dev/vda1 50.0G 7.1G 42.9G 14% /home/jenkins
shm 64.0M 0 64.0M 0% /dev/shm
/dev/vda1 50.0G 7.1G 42.9G 14% /etc/resolv.conf
/dev/vda1 50.0G 7.1G 42.9G 14% /etc/hostname
/dev/vda1 50.0G 7.1G 42.9G 14% /etc/hosts
/dev/vda1 50.0G 7.1G 42.9G 14% /var/log/sa
/dev/vda1 50.0G 7.1G 42.9G 14% <https://jenkins.edgexfoundry.org/job/device-grove-c-snap-fuji-stage-snap/ws/>
/dev/vda1 50.0G 7.1G 42.9G 14% <https://jenkins.edgexfoundry.org/job/device-grove-c-snap-fuji-stage-snap/ws/@tmp>


---> free -m:
total used free shared buff/cache available
Mem: 1838 679 114 0 1044 1076
Swap: 1023 1 1022


---> ip addr:
1: lo: <LOOPBACK,UP,LOWER_UP> mtu 65536 qdisc noqueue state UNKNOWN qlen 1000
link/loopback 00:00:00:00:00:00 brd 00:00:00:00:00:00
inet 127.0.0.1/8 scope host lo
valid_lft forever preferred_lft forever
10: eth0@if11: <BROADCAST,MULTICAST,UP,LOWER_UP,M-DOWN> mtu 1458 qdisc noqueue state UP
link/ether 02:42:0a:fa:00:01 brd ff:ff:ff:ff:ff:ff
inet 10.250.0.1/24 brd 10.250.0.255 scope global eth0
valid_lft forever preferred_lft forever


---> sar -b -r -n DEV:
Linux 3.10.0-862.14.4.el7.x86_64 (centos-7-docker-5bc7e375-1660-33dc-fe50-cb0f4dbfa1d5.vexxhost.ne) 02/23/20 _x86_64_ (4 CPU)

03:59:28 LINUX RESTART

04:00:01 tps rtps wtps bread/s bwrtn/s
04:01:01 165.08 15.43 149.65 2708.65 31064.87
04:02:02 582.16 401.20 180.96 21725.39 29213.07
04:03:01 296.85 103.74 193.11 5305.52 25993.52
04:04:01 137.95 54.98 82.97 2775.90 5867.11
04:05:01 90.98 55.36 35.61 4137.06 7383.42
Average: 254.97 126.61 128.36 7359.01 19910.64

04:00:01 kbmemfree kbmemused %memused kbbuffers kbcached kbcommit %commit kbactive kbinact kbdirty
04:01:01 64596 1817708 96.57 2620 1057328 1348584 46.01 490532 1053712 100800
04:02:02 84752 1797552 95.50 2452 1109384 1107248 37.78 454780 1059604 46400
04:03:01 71520 1810784 96.20 2176 1020716 1164780 39.74 604704 941364 5916
04:04:01 196400 1685904 89.57 1888 943360 1110168 37.88 549632 865940 11864
04:05:01 335816 1546488 82.16 1888 899228 1130508 38.57 508476 801628 62816
Average: 150617 1731687 92.00 2205 1006003 1172258 40.00 521625 944450 45559

04:00:01 IFACE rxpck/s txpck/s rxkB/s txkB/s rxcmp/s txcmp/s rxmcst/s
04:01:01 vethe5f9af4 605.82 678.85 42.32 3919.54 0.00 0.00 0.00
04:01:01 eth0 1231.64 816.21 4948.31 100.67 0.00 0.00 0.00
04:01:01 lo 0.10 0.10 0.01 0.01 0.00 0.00 0.00
04:01:01 docker0 605.82 678.72 34.03 3919.53 0.00 0.00 0.00
04:02:02 eth0 0.78 0.71 0.16 0.18 0.00 0.00 0.00
04:02:02 lo 0.00 0.00 0.00 0.00 0.00 0.00 0.00
04:02:02 docker0 0.00 0.00 0.00 0.00 0.00 0.00 0.00
04:03:01 veth7763981 137.45 192.70 9.76 2032.22 0.00 0.00 0.00
04:03:01 eth0 1463.29 983.02 7090.54 115.64 0.00 0.00 0.00
04:03:01 lo 0.10 0.10 0.01 0.01 0.00 0.00 0.00
04:03:01 docker0 756.40 886.00 42.65 6036.69 0.00 0.00 0.00
04:04:01 veth7763981 22.25 25.32 1.96 97.07 0.00 0.00 0.00
04:04:01 eth0 43.91 39.90 101.18 6.44 0.00 0.00 0.00
04:04:01 lo 0.00 0.00 0.00 0.00 0.00 0.00 0.00
04:04:01 docker0 22.25 25.32 1.66 97.07 0.00 0.00 0.00
04:05:01 eth0 246.77 215.45 2663.23 28.37 0.00 0.00 0.00
04:05:01 lo 0.00 0.00 0.00 0.00 0.00 0.00 0.00
04:05:01 docker0 107.33 112.82 5.84 513.54 0.00 0.00 0.00
Average: eth0 319.29 224.85 1872.12 25.56 0.00 0.00 0.00
Average: lo 0.00 0.00 0.00 0.00 0.00 0.00 0.00
Average: docker0 174.77 201.98 9.89 1310.02 0.00 0.00 0.00


---> sar -P ALL:
Linux 3.10.0-862.14.4.el7.x86_64 (centos-7-docker-5bc7e375-1660-33dc-fe50-cb0f4dbfa1d5.vexxhost.ne) 02/23/20 _x86_64_ (4 CPU)

03:59:28 LINUX RESTART

04:00:01 CPU %user %nice %system %iowait %steal %idle
04:01:01 all 15.65 0.00 6.80 4.07 0.01 73.48
04:01:01 0 21.80 0.00 8.15 2.03 0.00 68.01
04:01:01 1 13.36 0.00 6.24 6.53 0.00 73.87
04:01:01 2 13.86 0.00 6.44 3.09 0.00 76.61
04:01:01 3 13.64 0.00 6.38 4.62 0.02 75.35
04:02:02 all 6.87 0.00 5.92 13.88 0.03 73.30
04:02:02 0 6.20 0.00 5.40 12.92 0.03 75.44
04:02:02 1 5.59 0.00 5.49 15.13 0.03 73.76
04:02:02 2 7.06 0.00 6.05 14.10 0.03 72.75
04:02:02 3 8.66 0.00 6.77 13.35 0.02 71.21
04:03:01 all 8.11 0.00 6.15 3.22 0.01 82.52
04:03:01 0 11.59 0.00 7.27 3.45 0.02 77.67
04:03:01 1 4.29 0.00 5.40 2.94 0.00 87.38
04:03:01 2 9.74 0.00 5.56 3.51 0.00 81.18
04:03:01 3 6.82 0.00 6.36 2.98 0.00 83.83
04:04:01 all 21.44 0.00 6.78 2.07 0.01 69.70
04:04:01 0 20.75 0.00 7.20 3.61 0.00 68.45
04:04:01 1 14.48 0.00 6.13 1.29 0.02 78.08
04:04:01 2 29.77 0.00 6.90 1.26 0.02 62.05
04:04:01 3 20.75 0.00 6.85 2.12 0.02 70.27
04:05:01 all 10.43 0.00 3.90 1.23 0.00 84.43
04:05:01 0 9.09 0.00 4.75 0.82 0.02 85.32
04:05:01 1 7.29 0.00 2.81 0.30 0.00 89.60
04:05:01 2 9.97 0.00 4.43 1.57 0.00 84.03
04:05:01 3 15.38 0.00 3.65 2.21 0.00 78.76
Average: all 12.52 0.00 5.91 4.90 0.01 76.67
Average: 0 13.88 0.00 6.55 4.58 0.01 74.98
Average: 1 9.02 0.00 5.21 5.24 0.01 80.52
Average: 2 14.10 0.00 5.88 4.71 0.01 75.30
Average: 3 13.08 0.00 6.00 5.05 0.01 75.86


-----END_OF_BUILD-----
Logs upload complete.
Build logs: <a href="https://logs.edgexfoundry.org/production/vex-yul-edgex-jenkins-1/device-grove-c-snap-fuji-stage-snap/101">https://logs.edgexfoundry.org/production/vex-yul-edgex-jenkins-1/device-grove-c-snap-fuji-stage-snap/101</a>
+ set +x
[description-setter] Description set: Build logs: <a href="https://logs.edgexfoundry.org/production/vex-yul-edgex-jenkins-1/device-grove-c-snap-fuji-stage-snap/101">https://logs.edgexfoundry.org/production/vex-yul-edgex-jenkins-1/device-grove-c-snap-fuji-stage-snap/101</a>

Build failed in Jenkins: edgex-ui-go-snap-fuji-stage-snap #102 #jenkins

Jenkins <jenkins-donotreply@...>
 

See <https://jenkins.edgexfoundry.org/job/edgex-ui-go-snap-fuji-stage-snap/102/display/redirect>

Changes:


------------------------------------------
[...truncated 65.70 KB...]
manpages set to automatically installed.
manpages-dev set to automatically installed.
netbase set to automatically installed.
openssh-client set to automatically installed.
patch set to automatically installed.
perl set to automatically installed.
perl-modules-5.26 set to automatically installed.
pinentry-curses set to automatically installed.
readline-common set to automatically installed.
xauth set to automatically installed.
xz-utils set to automatically installed.
The following snaps are required but not installed as snapcraft is running inside docker or podman container: core18.
Please ensure the environment is properly setup before continuing.
Ignore this message if the appropriate measures have already been taken
Pulling go
'edgex-ui-go' has dependencies that need to be staged: go
Skipping pull go (already ran)
Building go
% Total % Received % Xferd Average Speed Time Time Time Current
Dload Upload Total Spent Left Speed
0 0 0 0 0 0 0 0 --:--:-- --:--:-- --:--:-- 0 5 115M 5 6207k 0 0 22.2M 0 0:00:05 --:--:-- 0:00:05 22.1M 85 115M 85 98.2M 0 0 86.6M 0 0:00:01 0:00:01 --:--:-- 86.6M
curl: (56) OpenSSL SSL_read: SSL_ERROR_SYSCALL, errno 104
Failed to run 'override-build': Exit code was 56.
Build step 'Execute shell' marked build as failure
$ ssh-agent -k
unset SSH_AUTH_SOCK;
unset SSH_AGENT_PID;
echo Agent pid 10106 killed;
[ssh-agent] Stopped.
[PostBuildScript] - [INFO] Executing post build scripts.
[edgex-ui-go-snap] $ /bin/bash /tmp/jenkins4941020571340281050.sh
---> sysstat.sh
[edgex-ui-go-snap] $ /bin/bash /tmp/jenkins2924603191448471492.sh
---> package-listing.sh
++ facter osfamily
++ tr '[:upper:]' '[:lower:]'
+ OS_FAMILY=redhat
+ workspace=<https://jenkins.edgexfoundry.org/job/edgex-ui-go-snap-fuji-stage-snap/ws/>
+ START_PACKAGES=/tmp/packages_start.txt
+ END_PACKAGES=/tmp/packages_end.txt
+ DIFF_PACKAGES=/tmp/packages_diff.txt
+ PACKAGES=/tmp/packages_start.txt
+ '[' <https://jenkins.edgexfoundry.org/job/edgex-ui-go-snap-fuji-stage-snap/ws/> ']'
+ PACKAGES=/tmp/packages_end.txt
+ case "${OS_FAMILY}" in
+ rpm -qa
+ sort
+ '[' -f /tmp/packages_start.txt ']'
+ '[' -f /tmp/packages_end.txt ']'
+ diff /tmp/packages_start.txt /tmp/packages_end.txt
+ '[' <https://jenkins.edgexfoundry.org/job/edgex-ui-go-snap-fuji-stage-snap/ws/> ']'
+ mkdir -p <https://jenkins.edgexfoundry.org/job/edgex-ui-go-snap-fuji-stage-snap/ws/archives/>
+ cp -f /tmp/packages_diff.txt /tmp/packages_end.txt /tmp/packages_start.txt <https://jenkins.edgexfoundry.org/job/edgex-ui-go-snap-fuji-stage-snap/ws/archives/>
provisioning config files...
copy managed file [jenkins-log-archives-settings] to file:<https://jenkins.edgexfoundry.org/job/edgex-ui-go-snap-fuji-stage-snap/ws/@tmp/config7963107152531285813tmp>
[edgex-ui-go-snap] $ /bin/bash /tmp/jenkins2877640922571700645.sh
---> edgex-infra-ship-logs.sh
Unable to find image 'nexus3.edgexfoundry.org:10003/edgex-lftools-log-publisher:x86_64' locally
x86_64: Pulling from edgex-lftools-log-publisher
e6b0cf9c0882: Pulling fs layer
da0e9bf0cc60: Pulling fs layer
c9ea274ed700: Pulling fs layer
9cfac6ba3733: Pulling fs layer
f6a933c9cadc: Pulling fs layer
61811dbd4963: Pulling fs layer
a6eb2c9e2280: Pulling fs layer
095dd8b7b4d8: Pulling fs layer
dc21a1d4508b: Pulling fs layer
363af2e989c4: Pulling fs layer
f6a933c9cadc: Waiting
61811dbd4963: Waiting
a6eb2c9e2280: Waiting
095dd8b7b4d8: Waiting
dc21a1d4508b: Waiting
363af2e989c4: Waiting
9cfac6ba3733: Waiting
da0e9bf0cc60: Verifying Checksum
da0e9bf0cc60: Download complete
9cfac6ba3733: Download complete
e6b0cf9c0882: Verifying Checksum
e6b0cf9c0882: Download complete
f6a933c9cadc: Verifying Checksum
f6a933c9cadc: Download complete
a6eb2c9e2280: Verifying Checksum
a6eb2c9e2280: Download complete
e6b0cf9c0882: Pull complete
c9ea274ed700: Verifying Checksum
c9ea274ed700: Download complete
095dd8b7b4d8: Verifying Checksum
095dd8b7b4d8: Download complete
da0e9bf0cc60: Pull complete
363af2e989c4: Verifying Checksum
363af2e989c4: Download complete
dc21a1d4508b: Verifying Checksum
dc21a1d4508b: Download complete
61811dbd4963: Verifying Checksum
61811dbd4963: Download complete
c9ea274ed700: Pull complete
9cfac6ba3733: Pull complete
f6a933c9cadc: Pull complete
61811dbd4963: Pull complete
a6eb2c9e2280: Pull complete
095dd8b7b4d8: Pull complete
dc21a1d4508b: Pull complete
363af2e989c4: Pull complete
Digest: sha256:add8188b58b49eaf945790de1a8bc2588125c85e750a42d0a8acc29426f6ed5f
Status: Downloaded newer image for nexus3.edgexfoundry.org:10003/edgex-lftools-log-publisher:x86_64
---> create-netrc.sh
---> logs-deploy.sh
+ ARCHIVE_ARTIFACTS=
+ LOGS_SERVER=https://logs.edgexfoundry.org
+ '[' https://logs.edgexfoundry.org '==' None ]
+ NEXUS_URL=https://nexus.edgexfoundry.org
+ NEXUS_PATH=production/vex-yul-edgex-jenkins-1/edgex-ui-go-snap-fuji-stage-snap/102
+ BUILD_URL=https://jenkins.edgexfoundry.org/job/edgex-ui-go-snap-fuji-stage-snap/102/
+ lftools deploy archives -p https://nexus.edgexfoundry.org production/vex-yul-edgex-jenkins-1/edgex-ui-go-snap-fuji-stage-snap/102 <https://jenkins.edgexfoundry.org/job/edgex-ui-go-snap-fuji-stage-snap/ws/>
Archives upload complete.
+ lftools deploy logs https://nexus.edgexfoundry.org production/vex-yul-edgex-jenkins-1/edgex-ui-go-snap-fuji-stage-snap/102 https://jenkins.edgexfoundry.org/job/edgex-ui-go-snap-fuji-stage-snap/102/
---> uname -a:
Linux e1b4a6172796 3.10.0-862.14.4.el7.x86_64 #1 SMP Wed Sep 26 15:12:11 UTC 2018 x86_64 Linux


---> lscpu:
Architecture: x86_64
CPU op-mode(s): 32-bit, 64-bit
Byte Order: Little Endian
Address sizes: 40 bits physical, 48 bits virtual
CPU(s): 4
On-line CPU(s) list: 0-3
Thread(s) per core: 1
Core(s) per socket: 1
Socket(s): 4
NUMA node(s): 1
Vendor ID: GenuineIntel
CPU family: 6
Model: 44
Model name: Westmere E56xx/L56xx/X56xx (IBRS update)
Stepping: 1
CPU MHz: 2933.396
BogoMIPS: 5866.79
Virtualization: VT-x
Hypervisor vendor: KVM
Virtualization type: full
L1d cache: 128 KiB
L1i cache: 128 KiB
L2 cache: 16 MiB
L3 cache: 64 MiB
NUMA node0 CPU(s): 0-3
Vulnerability L1tf: Mitigation; PTE Inversion; VMX SMT disabled, L1D conditional cache flushes
Vulnerability Meltdown: Mitigation; PTI
Vulnerability Spec store bypass: Mitigation; Speculative Store Bypass disabled via prctl and seccomp
Vulnerability Spectre v1: Mitigation; Load fences, __user pointer sanitization
Vulnerability Spectre v2: Mitigation; Full retpoline
Flags: fpu vme de pse tsc msr pae mce cx8 apic sep mtrr pge mca cmov pat pse36 clflush mmx fxsr sse sse2 ss syscall nx pdpe1gb rdtscp lm constant_tsc rep_good nopl xtopology eagerfpu pni pclmulqdq vmx ssse3 cx16 pcid sse4_1 sse4_2 x2apic popcnt tsc_deadline_timer aes hypervisor lahf_lm ssbd ibrs ibpb stibp tpr_shadow vnmi flexpriority ept vpid tsc_adjust arat spec_ctrl intel_stibp


---> nproc:
4


---> df -h:
Filesystem Size Used Available Use% Mounted on
overlay 50.0G 7.1G 42.9G 14% /
tmpfs 64.0M 0 64.0M 0% /dev
tmpfs 919.1M 0 919.1M 0% /sys/fs/cgroup
/dev/vda1 50.0G 7.1G 42.9G 14% /home/jenkins
shm 64.0M 0 64.0M 0% /dev/shm
/dev/vda1 50.0G 7.1G 42.9G 14% /etc/resolv.conf
/dev/vda1 50.0G 7.1G 42.9G 14% /etc/hostname
/dev/vda1 50.0G 7.1G 42.9G 14% /etc/hosts
/dev/vda1 50.0G 7.1G 42.9G 14% /var/log/sa
/dev/vda1 50.0G 7.1G 42.9G 14% <https://jenkins.edgexfoundry.org/job/edgex-ui-go-snap-fuji-stage-snap/ws/>
/dev/vda1 50.0G 7.1G 42.9G 14% <https://jenkins.edgexfoundry.org/job/edgex-ui-go-snap-fuji-stage-snap/ws/@tmp>


---> free -m:
total used free shared buff/cache available
Mem: 1838 685 79 0 1073 1072
Swap: 1023 1 1022


---> ip addr:
1: lo: <LOOPBACK,UP,LOWER_UP> mtu 65536 qdisc noqueue state UNKNOWN qlen 1000
link/loopback 00:00:00:00:00:00 brd 00:00:00:00:00:00
inet 127.0.0.1/8 scope host lo
valid_lft forever preferred_lft forever
10: eth0@if11: <BROADCAST,MULTICAST,UP,LOWER_UP,M-DOWN> mtu 1458 qdisc noqueue state UP
link/ether 02:42:0a:fa:00:01 brd ff:ff:ff:ff:ff:ff
inet 10.250.0.1/24 brd 10.250.0.255 scope global eth0
valid_lft forever preferred_lft forever


---> sar -b -r -n DEV:
Linux 3.10.0-862.14.4.el7.x86_64 (centos-7-docker-5bc7e375-1660-33dc-fe50-cb0f4dbfa1d5.vexxhost.ne) 02/22/20 _x86_64_ (4 CPU)

23:09:53 LINUX RESTART

23:11:01 tps rtps wtps bread/s bwrtn/s
23:12:01 449.52 243.03 206.49 16109.19 35818.43
23:13:01 418.39 244.96 173.44 10697.62 24714.25
Average: 433.95 243.99 189.96 13403.40 30266.34

23:11:01 kbmemfree kbmemused %memused kbbuffers kbcached kbcommit %commit kbactive kbinact kbdirty
23:12:01 77796 1804508 95.87 2520 1141600 1093644 37.31 360292 1172336 78832
23:13:01 157892 1724412 91.61 1940 945540 1162576 39.67 561688 906648 26772
Average: 117844 1764460 93.74 2230 1043570 1128110 38.49 460990 1039492 52802

23:11:01 IFACE rxpck/s txpck/s rxkB/s txkB/s rxcmp/s txcmp/s rxmcst/s
23:12:01 eth0 158.22 127.76 1960.85 8.47 0.00 0.00 0.00
23:12:01 lo 0.00 0.00 0.00 0.00 0.00 0.00 0.00
23:12:01 docker0 126.80 156.72 6.53 1960.63 0.00 0.00 0.00
23:13:01 vethc65f06a 83.36 107.29 5.93 911.15 0.00 0.00 0.00
23:13:01 eth0 876.33 666.43 5906.15 91.76 0.00 0.00 0.00
23:13:01 lo 0.10 0.10 0.01 0.01 0.00 0.00 0.00
23:13:01 docker0 378.30 458.06 21.33 4823.65 0.00 0.00 0.00
Average: vethc65f06a 41.68 53.65 2.97 455.58 0.00 0.00 0.00
Average: eth0 137.10 109.24 1436.91 8.15 0.00 0.00 0.00
Average: lo 0.00 0.00 0.00 0.00 0.00 0.00 0.00
Average: docker0 105.08 131.94 5.66 1435.88 0.00 0.00 0.00


---> sar -P ALL:
Linux 3.10.0-862.14.4.el7.x86_64 (centos-7-docker-5bc7e375-1660-33dc-fe50-cb0f4dbfa1d5.vexxhost.ne) 02/22/20 _x86_64_ (4 CPU)

23:09:53 LINUX RESTART

23:11:01 CPU %user %nice %system %iowait %steal %idle
23:12:01 all 9.44 0.00 5.59 8.59 0.02 76.37
23:12:01 0 11.14 0.00 6.02 8.42 0.00 74.41
23:12:01 1 7.96 0.00 5.62 9.72 0.02 76.68
23:12:01 2 10.52 0.00 5.68 9.42 0.02 74.36
23:12:01 3 8.14 0.00 5.04 6.79 0.02 80.01
23:13:01 all 7.10 0.00 6.47 8.06 0.03 78.34
23:13:01 0 6.40 0.00 6.57 7.87 0.03 79.12
23:13:01 1 11.59 0.00 7.11 10.63 0.03 70.63
23:13:01 2 5.84 0.00 6.23 6.31 0.03 81.58
23:13:01 3 4.53 0.00 5.97 7.41 0.02 82.07
Average: all 8.27 0.00 6.03 8.33 0.02 77.35
Average: 0 8.77 0.00 6.30 8.15 0.02 76.76
Average: 1 9.78 0.00 6.36 10.18 0.03 73.66
Average: 2 8.18 0.00 5.95 7.87 0.03 77.97
Average: 3 6.34 0.00 5.51 7.10 0.02 81.04


-----END_OF_BUILD-----
Logs upload complete.
+ set +x
Build logs: <a href="https://logs.edgexfoundry.org/production/vex-yul-edgex-jenkins-1/edgex-ui-go-snap-fuji-stage-snap/102">https://logs.edgexfoundry.org/production/vex-yul-edgex-jenkins-1/edgex-ui-go-snap-fuji-stage-snap/102</a>
[description-setter] Description set: Build logs: <a href="https://logs.edgexfoundry.org/production/vex-yul-edgex-jenkins-1/edgex-ui-go-snap-fuji-stage-snap/102">https://logs.edgexfoundry.org/production/vex-yul-edgex-jenkins-1/edgex-ui-go-snap-fuji-stage-snap/102</a>