Topics

Build failed in Jenkins: edgex-go-master-verify-go-arm #4518 #jenkins

Jenkins <jenkins-donotreply@...>
 

See <https://jenkins.edgexfoundry.org/job/edgex-go-master-verify-go-arm/4518/display/redirect>

Changes:


------------------------------------------
[...truncated 4.94 KB...]
Login Succeeded
docker.io
WARNING! Using --password via the CLI is insecure. Use --password-stdin.
WARNING! Your password will be stored unencrypted in /home/jenkins/.docker/config.json.
Configure a credential helper to remove this warning. See
https://docs.docker.com/engine/reference/commandline/login/#credentials-store

Login Succeeded
[edgex-go] $ /bin/bash /tmp/jenkins6381286742407769925.sh
provisioning config files...
copy managed file [global-settings] to file:<https://jenkins.edgexfoundry.org/job/edgex-go-master-verify-go-arm/ws/@tmp/config2399375575130825116tmp>
copy managed file [edgex-go-settings] to file:<https://jenkins.edgexfoundry.org/job/edgex-go-master-verify-go-arm/ws/@tmp/config9189829638407337875tmp>
[EnvInject] - Injecting environment variables from a build step.
[EnvInject] - Injecting as environment variables the properties content
PATH=/usr/local/sbin:/usr/local/bin:/usr/sbin:/usr/bin:/sbin:/bin:/usr/games:/usr/local/games:$GOROOT/bin
GOROOT=/opt/go-custom/go
GOPROXY=https://nexus3.edgexfoundry.org/repository/go-proxy/
GOARCH=arm64
GOOS=linux
GOPATH=/home/jenkins/4518/gopath

[EnvInject] - Variables injected successfully.
[edgex-go] $ /bin/sh -xe /tmp/jenkins8397878589589474473.sh
[edgex-go] $ /bin/bash /tmp/jenkins5104092614988818329.sh
--> install_custom_golang.sh
% Total % Received % Xferd Average Speed Time Time Time Current
Dload Upload Total Spent Left Speed
0 0 0 0 0 0 0 0 --:--:-- --:--:-- --:--:-- 0 6 94.2M 6 6303k 0 0 22.3M 0 0:00:04 --:--:-- 0:00:04 22.3M 50 94.2M 50 47.7M 0 0 37.7M 0 0:00:02 0:00:01 0:00:01 37.7M 94 94.2M 94 89.4M 0 0 39.6M 0 0:00:02 0:00:02 --:--:-- 39.6M100 94.2M 100 94.2M 0 0 39.9M 0 0:00:02 0:00:02 --:--:-- 39.9M
go version go1.11.5 linux/arm64
[edgex-go] $ /bin/sh -xe /tmp/jenkins2021144021360069484.sh
+ make test raml_verify
GO111MODULE=on go test -coverprofile=coverage.out ./...
go: finding gopkg.in/yaml.v2 v2.2.7
go: finding github.com/cloudflare/gokey v0.1.0
go: finding github.com/gorilla/mux v1.7.1
go: parsing ../go-mod-bootstrap/go.mod: open /home/jenkins/4518/gopath/src/github.com/edgexfoundry/go-mod-bootstrap/go.mod: no such file or directory
go: finding bitbucket.org/bertimus9/systemstat v0.0.0-20180207000608-0eeff89b0690
go: finding github.com/dgrijalva/jwt-go v3.2.0+incompatible
go: finding github.com/imdario/mergo v0.3.6
go: finding github.com/OneOfOne/xxhash v1.2.5
go: finding github.com/pelletier/go-toml v1.2.0
go: finding github.com/edgexfoundry/go-mod-registry v0.1.12
go: finding github.com/edgexfoundry/go-mod-secrets v0.0.14
go: finding github.com/gomodule/redigo v2.0.0+incompatible
go: finding github.com/robfig/cron v0.0.0-20180505203441-b41be1df6967
go: finding github.com/ugorji/go v1.1.4
go: finding github.com/BurntSushi/toml v0.3.1
go: finding github.com/edgexfoundry/go-mod-messaging v0.1.9
go: finding gopkg.in/eapache/queue.v1 v1.1.0
go: finding github.com/google/uuid v1.1.0
go: finding github.com/edgexfoundry/go-mod-core-contracts v0.1.37
go: finding github.com/magiconair/properties v1.8.0
go: finding github.com/globalsign/mgo v0.0.0-20181015135952-eeefdecb41b8
go: finding github.com/stretchr/testify v1.3.0
go: finding github.com/pkg/errors v0.8.1
go: error loading module requirements
Makefile:74: recipe for target 'test' failed
make: *** [test] Error 1
Build step 'Execute shell' marked build as failure
$ ssh-agent -k
unset SSH_AUTH_SOCK;
unset SSH_AGENT_PID;
echo Agent pid 1929 killed;
[ssh-agent] Stopped.
[PostBuildScript] - [INFO] Executing post build scripts.
[edgex-go] $ /bin/bash /tmp/jenkins8037054785744094023.sh
---> sysstat.sh
2020-01-16 15:55:37.786648 WARN puppetlabs.facter - could not locate a ruby library: facts requiring Ruby will not be resolved.
2020-01-16 15:55:38.214333 WARN puppetlabs.facter - could not locate a ruby library: facts requiring Ruby will not be resolved.
End of system activity file unexpected
[edgex-go] $ /bin/bash /tmp/jenkins8192564286788026875.sh
---> package-listing.sh
++ facter osfamily
++ tr '[:upper:]' '[:lower:]'
2020-01-16 15:55:38.801081 WARN puppetlabs.facter - could not locate a ruby library: facts requiring Ruby will not be resolved.
+ OS_FAMILY=debian
+ workspace=<https://jenkins.edgexfoundry.org/job/edgex-go-master-verify-go-arm/ws/>
+ START_PACKAGES=/tmp/packages_start.txt
+ END_PACKAGES=/tmp/packages_end.txt
+ DIFF_PACKAGES=/tmp/packages_diff.txt
+ PACKAGES=/tmp/packages_start.txt
+ '[' <https://jenkins.edgexfoundry.org/job/edgex-go-master-verify-go-arm/ws/> ']'
+ PACKAGES=/tmp/packages_end.txt
+ case "${OS_FAMILY}" in
+ grep '^ii'
+ dpkg -l
+ '[' -f /tmp/packages_start.txt ']'
+ '[' -f /tmp/packages_end.txt ']'
+ diff /tmp/packages_start.txt /tmp/packages_end.txt
+ '[' <https://jenkins.edgexfoundry.org/job/edgex-go-master-verify-go-arm/ws/> ']'
+ mkdir -p <https://jenkins.edgexfoundry.org/job/edgex-go-master-verify-go-arm/ws/archives/>
+ cp -f /tmp/packages_diff.txt /tmp/packages_end.txt /tmp/packages_start.txt <https://jenkins.edgexfoundry.org/job/edgex-go-master-verify-go-arm/ws/archives/>
provisioning config files...
copy managed file [jenkins-log-archives-settings] to file:<https://jenkins.edgexfoundry.org/job/edgex-go-master-verify-go-arm/ws/@tmp/config3029682306489379499tmp>
[edgex-go] $ /bin/bash /tmp/jenkins5487305552842181228.sh
---> edgex-infra-ship-logs.sh
Unable to find image 'nexus3.edgexfoundry.org:10003/edgex-lftools-log-publisher:aarch64' locally
aarch64: Pulling from edgex-lftools-log-publisher
cde5963f3b93: Pulling fs layer
1cf707181fc0: Pulling fs layer
ecc8062bd8ae: Pulling fs layer
f73053cda371: Pulling fs layer
21891ac9f69c: Pulling fs layer
91256cc9b400: Pulling fs layer
1bd1ff0e301d: Pulling fs layer
55838df30d5e: Pulling fs layer
fe38a35a6fa4: Pulling fs layer
736cb92344f5: Pulling fs layer
f73053cda371: Waiting
21891ac9f69c: Waiting
91256cc9b400: Waiting
1bd1ff0e301d: Waiting
55838df30d5e: Waiting
fe38a35a6fa4: Waiting
736cb92344f5: Waiting
1cf707181fc0: Verifying Checksum
1cf707181fc0: Download complete
f73053cda371: Verifying Checksum
f73053cda371: Download complete
cde5963f3b93: Verifying Checksum
cde5963f3b93: Download complete
21891ac9f69c: Verifying Checksum
21891ac9f69c: Download complete
1bd1ff0e301d: Verifying Checksum
1bd1ff0e301d: Download complete
cde5963f3b93: Pull complete
1cf707181fc0: Pull complete
55838df30d5e: Verifying Checksum
55838df30d5e: Download complete
fe38a35a6fa4: Verifying Checksum
fe38a35a6fa4: Download complete
736cb92344f5: Verifying Checksum
736cb92344f5: Download complete
ecc8062bd8ae: Verifying Checksum
ecc8062bd8ae: Download complete
91256cc9b400: Verifying Checksum
91256cc9b400: Download complete
ecc8062bd8ae: Pull complete
f73053cda371: Pull complete
21891ac9f69c: Pull complete
91256cc9b400: Pull complete
1bd1ff0e301d: Pull complete
55838df30d5e: Pull complete
fe38a35a6fa4: Pull complete
736cb92344f5: Pull complete
Digest: sha256:e038adae1539a751c2d66fc650b1ee2b29832e64e1c88087ccfc4b874f27da29
Status: Downloaded newer image for nexus3.edgexfoundry.org:10003/edgex-lftools-log-publisher:aarch64
---> create-netrc.sh
---> logs-deploy.sh
+ ARCHIVE_ARTIFACTS=
+ LOGS_SERVER=https://logs.edgexfoundry.org
+ '[' https://logs.edgexfoundry.org '==' None ]
+ NEXUS_URL=https://nexus.edgexfoundry.org
+ NEXUS_PATH=production/vex-yul-edgex-jenkins-1/edgex-go-master-verify-go-arm/4518
+ BUILD_URL=https://jenkins.edgexfoundry.org/job/edgex-go-master-verify-go-arm/4518/
+ lftools deploy archives -p https://nexus.edgexfoundry.org production/vex-yul-edgex-jenkins-1/edgex-go-master-verify-go-arm/4518 <https://jenkins.edgexfoundry.org/job/edgex-go-master-verify-go-arm/ws/>
Archives upload complete.
+ lftools deploy logs https://nexus.edgexfoundry.org production/vex-yul-edgex-jenkins-1/edgex-go-master-verify-go-arm/4518 https://jenkins.edgexfoundry.org/job/edgex-go-master-verify-go-arm/4518/
---> uname -a:
Linux a007e579170f 4.15.0-38-generic #41-Ubuntu SMP Wed Oct 10 10:59:31 UTC 2018 aarch64 Linux


---> lscpu:
Architecture: aarch64
CPU op-mode(s): 64-bit
Byte Order: Little Endian
CPU(s): 2
On-line CPU(s) list: 0,1
Thread(s) per core: 1
Core(s) per socket: 2
Socket(s): 1
NUMA node(s): 1
Vendor ID: Cavium
Model: 1
Model name: ThunderX 88XX
Stepping: 0x1
BogoMIPS: 200.00
NUMA node0 CPU(s): 0,1
Flags: fp asimd evtstrm aes pmull sha1 sha2 crc32 cpuid


---> nproc:
2


---> df -h:
Filesystem Size Used Available Use% Mounted on
overlay 38.6G 5.8G 32.7G 15% /
tmpfs 64.0M 0 64.0M 0% /dev
tmpfs 3.9G 0 3.9G 0% /sys/fs/cgroup
/dev/vda1 38.6G 5.8G 32.7G 15% /home/jenkins
shm 64.0M 0 64.0M 0% /dev/shm
/dev/vda1 38.6G 5.8G 32.7G 15% /etc/resolv.conf
/dev/vda1 38.6G 5.8G 32.7G 15% /etc/hostname
/dev/vda1 38.6G 5.8G 32.7G 15% /etc/hosts
/dev/vda1 38.6G 5.8G 32.7G 15% /var/log/sa
/dev/vda1 38.6G 5.8G 32.7G 15% <https://jenkins.edgexfoundry.org/job/edgex-go-master-verify-go-arm/ws/>
/dev/vda1 38.6G 5.8G 32.7G 15% <https://jenkins.edgexfoundry.org/job/edgex-go-master-verify-go-arm/ws/@tmp>


---> free -m:
total used free shared buff/cache available
Mem: 7973 572 4848 0 2552 7339
Swap: 1023 0 1023


---> ip addr:
1: lo: <LOOPBACK,UP,LOWER_UP> mtu 65536 qdisc noqueue state UNKNOWN qlen 1000
link/loopback 00:00:00:00:00:00 brd 00:00:00:00:00:00
inet 127.0.0.1/8 scope host lo
valid_lft forever preferred_lft forever
4: eth0@if5: <BROADCAST,MULTICAST,UP,LOWER_UP,M-DOWN> mtu 1458 qdisc noqueue state UP
link/ether 02:42:0a:fa:00:01 brd ff:ff:ff:ff:ff:ff
inet 10.250.0.1/24 brd 10.250.0.255 scope global eth0
valid_lft forever preferred_lft forever


Invalid system activity file: /var/log/sa/sa16
File created by sar/sadc from sysstat version 11.6.1
Current sysstat version cannot read the format of this file (0x2173)
Traceback (most recent call last):
File "/usr/local/bin/lftools", line 8, in <module>
sys.exit(main())
File "/usr/local/lib/python3.8/site-packages/lftools/cli/__init__.py", line 110, in main
cli(obj={})
File "/usr/local/lib/python3.8/site-packages/click/core.py", line 764, in __call__
return self.main(*args, **kwargs)
File "/usr/local/lib/python3.8/site-packages/click/core.py", line 717, in main
rv = self.invoke(ctx)
File "/usr/local/lib/python3.8/site-packages/click/core.py", line 1137, in invoke
return _process_result(sub_ctx.command.invoke(sub_ctx))
File "/usr/local/lib/python3.8/site-packages/click/core.py", line 1137, in invoke
return _process_result(sub_ctx.command.invoke(sub_ctx))
File "/usr/local/lib/python3.8/site-packages/click/core.py", line 956, in invoke
return ctx.invoke(self.callback, **ctx.params)
File "/usr/local/lib/python3.8/site-packages/click/core.py", line 555, in invoke
return callback(*args, **kwargs)
File "/usr/local/lib/python3.8/site-packages/click/decorators.py", line 17, in new_func
return f(get_current_context(), *args, **kwargs)
File "/usr/local/lib/python3.8/site-packages/lftools/cli/deploy.py", line 139, in logs
deploy_sys.deploy_logs(nexus_url, nexus_path, build_url)
File "/usr/local/lib/python3.8/site-packages/lftools/deploy.py", line 293, in deploy_logs
output = subprocess.check_output(c).decode('utf-8')
File "/usr/local/lib/python3.8/subprocess.py", line 411, in check_output
return run(*popenargs, stdout=PIPE, timeout=timeout, check=True,
File "/usr/local/lib/python3.8/subprocess.py", line 512, in run
raise CalledProcessError(retcode, process.args,
subprocess.CalledProcessError: Command '['sar', '-b', '-r', '-n', 'DEV']' returned non-zero exit status 3.
[description-setter] Could not determine description.